{"text_format":"1","workbook":"xlsx","n_sheets":10,"sheets":["Instrukcja","Validation","Informacje o klasie","Wyniki z Sekcji 1","Wyniki z Sekcji 2","Wyniki z Sekcji 3","Raport ucznia","Raport klasy - ogólny","Raport klasy - szczegółowy","Hello"],"not_rendered":{"charts":7,"images":9,"macros":1,"external_links":0,"defined_names":11,"comments":0,"pivot_tables":0},"unopened":[],"bounds":{"document_bytes":16777216,"sheet_cells":100000,"rows_first":2000,"rows_last":500,"rows_between":2000,"halvings":0,"cell_chars":16384,"cell_head_chars":4096},"cells_cut":0,"cells_raw":0,"read":"whole","date_system":"1900"}

{"sheet":"Instrukcja","index":0,"n_rows":6,"n_cols":3,"rows_kept":6,"cut":false,"hidden":false,"merged":[]}
[]
[null,1,"Zapisz oddzielną kopię tego pliku dla każdej klasy lub grupy, w której uczysz. "]
[null,2,"W arkuszu „Informacje o klasie” wpisz nazwę klasy lub grupy, np. Klasa IV a, Klasa IV b lub Grupa 1. \nWybierz tytuł podręcznika, z którego będziesz korzystać w danym roku szkolnym.\nWpisz imiona i nazwiska wszystkich uczniów z klasy lub grupy."]
[null,3,"Po ukończeniu testu przez klasę wpisz datę jego przeprowadzenia w arkuszu „Informacje o klasie”, a następnie wpisz wyniki testu w odpowiednich arkuszach: „Wyniki z Sekcji 1” „Wyniki z Sekcji 2” lub „Wyniki z Sekcji 3”."]
[null,4,"Raport podsumowujący wyniki każdego ucznia dostępny jest w arkuszu „Raport ucznia”."]
[null,5,"Raport podsumowujący wyniki każdego ucznia dostępny jest w arkuszu „Raport ucznia”."]

{"sheet":"Validation","index":1,"n_rows":9,"n_cols":13,"rows_kept":9,"cut":false,"hidden":true,"merged":[]}
["Choice list","AC","AD","AE","AH","TF","1-4","1-3","1-2","Test levels","Courebook levels",null,"Course"]
["AC","A","A","A","A","P",0,0,0,"Diagnostic test 2","for the start of grade 5",null,"Link"]
["AD","B","B","B","B","F",1,1,1,null,null,null,"Steps Plus"]
["AE","C","C","C","C",null,2,2,2,null,null,null,"Team Up Plus"]
["AH",null,"D","D","D",null,3,3,null,null,null,null,"Oxford Repetytorium Ósmoklasisty"]
["TF",null,null,"E","E",null,4]
[null,null,null,null,"F"]
[null,null,null,null,"G"]
[null,null,null,null,"H"]

{"sheet":"Informacje o klasie","index":2,"n_rows":112,"n_cols":6,"rows_kept":112,"cut":false,"hidden":false,"merged":[]}
[]
[null,"Informacje o klasie lub grupie"]
[]
[null,"Nazwa klasy lub grupy"]
[null,"Numer testu diagnostycznego","Test diagnostyczny 5"]
[null,"Podręcznik"]
[null,"Test w klasie","VIII"]
[null,"Data testu - Sekcja 1"]
[null,"Data testu - Sekcja 2"]
[null,"Data testu - Sekcja 3"]
[null,"Liczba uczniów (autosuma)",{"$f":"COUNTA(C14:C112)","v":0}]
[]
[null,"Numer","Nazwisko","Imię"]
[null,1,null,null,null,{"$f":"IF(ISBLANK(C14),\"\",UPPER(C14)&\", \"&D14)","v":""}]
[null,2,null,null,null,{"$f":"IF(ISBLANK(C15),\"\",UPPER(C15)&\", \"&D15)","v":""}]
[null,3,null,null,null,{"$f":"IF(ISBLANK(C16),\"\",UPPER(C16)&\", \"&D16)","v":""}]
[null,4,null,null,null,{"$f":"IF(ISBLANK(C17),\"\",UPPER(C17)&\", \"&D17)","v":""}]
[null,5,null,null,null,{"$f":"IF(ISBLANK(C18),\"\",UPPER(C18)&\", \"&D18)","v":""}]
[null,6,null,null,null,{"$f":"IF(ISBLANK(C19),\"\",UPPER(C19)&\", \"&D19)","v":""}]
[null,7,null,null,null,""]
[null,8,null,null,null,""]
[null,9,null,null,null,""]
[null,10,null,null,null,""]
[null,11,null,null,null,""]
[null,12,null,null,null,""]
[null,13,null,null,null,""]
[null,14,null,null,null,""]
[null,15,null,null,null,""]
[null,16,null,null,null,""]
[null,17,null,null,null,""]
[null,18,null,null,null,""]
[null,19,null,null,null,""]
[null,20,null,null,null,""]
[null,21,null,null,null,""]
[null,22,null,null,null,""]
[null,23,null,null,null,""]
[null,24,null,null,null,""]
[null,25,null,null,null,""]
[null,26,null,null,null,""]
[null,27,null,null,null,""]
[null,28,null,null,null,""]
[null,29,null,null,null,""]
[null,30,null,null,null,""]
[null,31,null,null,null,""]
[null,32,null,null,null,""]
[null,33,null,null,null,""]
[null,34,null,null,null,""]
[null,35,null,null,null,""]
[null,36,null,null,null,""]
[null,37,null,null,null,""]
[null,38,null,null,null,""]
[null,39,null,null,null,""]
[null,40,null,null,null,""]
[null,41,null,null,null,""]
[null,42,null,null,null,""]
[null,43,null,null,null,""]
[null,44,null,null,null,""]
[null,45,null,null,null,""]
[null,46,null,null,null,""]
[null,47,null,null,null,""]
[null,48,null,null,null,""]
[null,49,null,null,null,""]
[null,50,null,null,null,""]
[null,51,null,null,null,""]
[null,52,null,null,null,""]
[null,53,null,null,null,""]
[null,54,null,null,null,""]
[null,55,null,null,null,""]
[null,56,null,null,null,""]
[null,57,null,null,null,""]
[null,58,null,null,null,""]
[null,59,null,null,null,""]
[null,60,null,null,null,""]
[null,61,null,null,null,""]
[null,62,null,null,null,""]
[null,63,null,null,null,""]
[null,64,null,null,null,""]
[null,65,null,null,null,""]
[null,66,null,null,null,""]
[null,67,null,null,null,""]
[null,68,null,null,null,""]
[null,69,null,null,null,{"$f":"IF(ISBLANK(C82),\"\",UPPER(C82)&\", \"&D82)","v":""}]
[null,70,null,null,null,""]
[null,71,null,null,null,""]
[null,72,null,null,null,""]
[null,73,null,null,null,""]
[null,74,null,null,null,""]
[null,75,null,null,null,""]
[null,76,null,null,null,""]
[null,77,null,null,null,""]
[null,78,null,null,null,""]
[null,79,null,null,null,""]
[null,80,null,null,null,""]
[null,81,null,null,null,""]
[null,82,null,null,null,""]
[null,83,null,null,null,""]
[null,84,null,null,null,""]
[null,85,null,null,null,""]
[null,86,null,null,null,""]
[null,87,null,null,null,""]
[null,88,null,null,null,""]
[null,89,null,null,null,""]
[null,90,null,null,null,""]
[null,91,null,null,null,""]
[null,92,null,null,null,""]
[null,93,null,null,null,""]
[null,94,null,null,null,""]
[null,95,null,null,null,""]
[null,96,null,null,null,""]
[null,97,null,null,null,""]
[null,98,null,null,null,""]
[null,99,null,null,null,""]

{"sheet":"Wyniki z Sekcji 1","index":3,"n_rows":226,"n_cols":26,"rows_kept":226,"cut":false,"hidden":false,"merged":[[122,1,122,3],[122,4,122,14],[122,15,122,25],[123,1,123,3],[8,1,8,3],[7,1,7,3],[7,4,7,14],[7,15,7,25],[112,4,112,14],[112,15,112,25]]}
[]
[null,{"$f":"\"Test diagnostyczny 5\"","v":"Test diagnostyczny 5"}]
[null,{"$f":"\"Wyniki z Sekcji 1 (Rozumienie ze słuchu i Rozumienie tekstów pisanych): \"&'Informacje o klasie'!C4","v":"Wyniki z Sekcji 1 (Rozumienie ze słuchu i Rozumienie tekstów pisanych): "}]
[null,{"$f":"\"Data testu - Sekcja 1: \"&'Informacje o klasie'!C8","v":"Data testu - Sekcja 1: "}]
[null,{"$f":"\"Podręcznik: \"&'Informacje o klasie'!C6","v":"Podręcznik: "}]
[null,"Test w klasie VIII"]
[]
[null,null,null,null,"ROZUMIENIE ZE SŁUCHU",null,null,null,null,null,null,null,null,null,null,"ROZUMIENIE TEKSTÓW PISANYCH"]
[null,"Zadanie:",null,null,1,2,3,4,5,6,7,8,9,10,"SUMA",1,2,3,4,5,6,7,8,9,10,"SUMA"]
[{"$f":"C10&\", \"&D10","v":"0, 0"},1,{"$f":"'Informacje o klasie'!C14","v":0},{"$f":"'Informacje o klasie'!D14","v":0},null,null,null,null,null,null,null,null,null,null,{"$f":"O125","v":0},null,null,null,null,null,null,null,null,null,null,{"$f":"Z125","v":0}]
[{"$f":"C11&\", \"&D11","v":"0, 0"},2,{"$f":"'Informacje o klasie'!C15","v":0},{"$f":"'Informacje o klasie'!D15","v":0},null,null,null,null,null,null,null,null,null,null,{"$f":"O126","v":0},null,null,null,null,null,null,null,null,null,null,{"$f":"Z126","v":0}]
["0, 0",3,{"$f":"'Informacje o klasie'!C16","v":0},{"$f":"'Informacje o klasie'!D16","v":0},null,null,null,null,null,null,null,null,null,null,0,null,null,null,null,null,null,null,null,null,null,0]
["0, 0",4,{"$f":"'Informacje o klasie'!C17","v":0},{"$f":"'Informacje o klasie'!D17","v":0},null,null,null,null,null,null,null,null,null,null,0,null,null,null,null,null,null,null,null,null,null,0]
["0, 0",5,{"$f":"'Informacje o klasie'!C18","v":0},{"$f":"'Informacje o klasie'!D18","v":0},null,null,null,null,null,null,null,null,null,null,0,null,null,null,null,null,null,null,null,null,null,0]
["0, 0",6,{"$f":"'Informacje o klasie'!C19","v":0},{"$f":"'Informacje o klasie'!D19","v":0},null,null,null,null,null,null,null,null,null,null,0,null,null,null,null,null,null,null,null,null,null,0]
["0, 0",7,{"$f":"'Informacje o klasie'!C20","v":0},{"$f":"'Informacje o klasie'!D20","v":0},null,null,null,null,null,null,null,null,null,null,0,null,null,null,null,null,null,null,null,null,null,0]
["0, 0",8,{"$f":"'Informacje o klasie'!C21","v":0},{"$f":"'Informacje o klasie'!D21","v":0},null,null,null,null,null,null,null,null,null,null,0,null,null,null,null,null,null,null,null,null,null,0]
["0, 0",9,{"$f":"'Informacje o klasie'!C22","v":0},{"$f":"'Informacje o klasie'!D22","v":0},null,null,null,null,null,null,null,null,null,null,0,null,null,null,null,null,null,null,null,null,null,0]
["0, 0",10,{"$f":"'Informacje o klasie'!C23","v":0},{"$f":"'Informacje o klasie'!D23","v":0},null,null,null,null,null,null,null,null,null,null,0,null,null,null,null,null,null,null,null,null,null,0]
["0, 0",11,{"$f":"'Informacje o klasie'!C24","v":0},{"$f":"'Informacje o klasie'!D24","v":0},null,null,null,null,null,null,null,null,null,null,0,null,null,null,null,null,null,null,null,null,null,0]
["0, 0",12,{"$f":"'Informacje o klasie'!C25","v":0},{"$f":"'Informacje o klasie'!D25","v":0},null,null,null,null,null,null,null,null,null,null,0,null,null,null,null,null,null,null,null,null,null,0]
["0, 0",13,{"$f":"'Informacje o klasie'!C26","v":0},{"$f":"'Informacje o klasie'!D26","v":0},null,null,null,null,null,null,null,null,null,null,0,null,null,null,null,null,null,null,null,null,null,0]
["0, 0",14,{"$f":"'Informacje o klasie'!C27","v":0},{"$f":"'Informacje o klasie'!D27","v":0},null,null,null,null,null,null,null,null,null,null,0,null,null,null,null,null,null,null,null,null,null,0]
["0, 0",15,{"$f":"'Informacje o klasie'!C28","v":0},{"$f":"'Informacje o klasie'!D28","v":0},null,null,null,null,null,null,null,null,null,null,0,null,null,null,null,null,null,null,null,null,null,0]
["0, 0",16,{"$f":"'Informacje o klasie'!C29","v":0},{"$f":"'Informacje o klasie'!D29","v":0},null,null,null,null,null,null,null,null,null,null,0,null,null,null,null,null,null,null,null,null,null,0]
["0, 0",17,{"$f":"'Informacje o klasie'!C30","v":0},{"$f":"'Informacje o klasie'!D30","v":0},null,null,null,null,null,null,null,null,null,null,0,null,null,null,null,null,null,null,null,null,null,0]
["0, 0",18,{"$f":"'Informacje o klasie'!C31","v":0},{"$f":"'Informacje o klasie'!D31","v":0},null,null,null,null,null,null,null,null,null,null,0,null,null,null,null,null,null,null,null,null,null,0]
["0, 0",19,{"$f":"'Informacje o klasie'!C32","v":0},{"$f":"'Informacje o klasie'!D32","v":0},null,null,null,null,null,null,null,null,null,null,0,null,null,null,null,null,null,null,null,null,null,0]
["0, 0",20,{"$f":"'Informacje o klasie'!C33","v":0},{"$f":"'Informacje o klasie'!D33","v":0},null,null,null,null,null,null,null,null,null,null,0,null,null,null,null,null,null,null,null,null,null,0]
["0, 0",21,{"$f":"'Informacje o klasie'!C34","v":0},{"$f":"'Informacje o klasie'!D34","v":0},null,null,null,null,null,null,null,null,null,null,0,null,null,null,null,null,null,null,null,null,null,0]
["0, 0",22,{"$f":"'Informacje o klasie'!C35","v":0},{"$f":"'Informacje o klasie'!D35","v":0},null,null,null,null,null,null,null,null,null,null,0,null,null,null,null,null,null,null,null,null,null,0]
["0, 0",23,{"$f":"'Informacje o klasie'!C36","v":0},{"$f":"'Informacje o klasie'!D36","v":0},null,null,null,null,null,null,null,null,null,null,0,null,null,null,null,null,null,null,null,null,null,0]
["0, 0",24,{"$f":"'Informacje o klasie'!C37","v":0},{"$f":"'Informacje o klasie'!D37","v":0},null,null,null,null,null,null,null,null,null,null,0,null,null,null,null,null,null,null,null,null,null,0]
["0, 0",25,{"$f":"'Informacje o klasie'!C38","v":0},{"$f":"'Informacje o klasie'!D38","v":0},null,null,null,null,null,null,null,null,null,null,0,null,null,null,null,null,null,null,null,null,null,0]
["0, 0",26,{"$f":"'Informacje o klasie'!C39","v":0},{"$f":"'Informacje o klasie'!D39","v":0},null,null,null,null,null,null,null,null,null,null,0,null,null,null,null,null,null,null,null,null,null,0]
["0, 0",27,{"$f":"'Informacje o klasie'!C40","v":0},{"$f":"'Informacje o klasie'!D40","v":0},null,null,null,null,null,null,null,null,null,null,0,null,null,null,null,null,null,null,null,null,null,0]
["0, 0",28,{"$f":"'Informacje o klasie'!C41","v":0},{"$f":"'Informacje o klasie'!D41","v":0},null,null,null,null,null,null,null,null,null,null,0,null,null,null,null,null,null,null,null,null,null,0]
["0, 0",29,{"$f":"'Informacje o klasie'!C42","v":0},{"$f":"'Informacje o klasie'!D42","v":0},null,null,null,null,null,null,null,null,null,null,0,null,null,null,null,null,null,null,null,null,null,0]
["0, 0",30,{"$f":"'Informacje o klasie'!C43","v":0},{"$f":"'Informacje o klasie'!D43","v":0},null,null,null,null,null,null,null,null,null,null,0,null,null,null,null,null,null,null,null,null,null,0]
["0, 0",31,{"$f":"'Informacje o klasie'!C44","v":0},{"$f":"'Informacje o klasie'!D44","v":0},null,null,null,null,null,null,null,null,null,null,0,null,null,null,null,null,null,null,null,null,null,0]
["0, 0",32,{"$f":"'Informacje o klasie'!C45","v":0},{"$f":"'Informacje o klasie'!D45","v":0},null,null,null,null,null,null,null,null,null,null,0,null,null,null,null,null,null,null,null,null,null,0]
["0, 0",33,{"$f":"'Informacje o klasie'!C46","v":0},{"$f":"'Informacje o klasie'!D46","v":0},null,null,null,null,null,null,null,null,null,null,0,null,null,null,null,null,null,null,null,null,null,0]
["0, 0",34,{"$f":"'Informacje o klasie'!C47","v":0},{"$f":"'Informacje o klasie'!D47","v":0},null,null,null,null,null,null,null,null,null,null,0,null,null,null,null,null,null,null,null,null,null,0]
["0, 0",35,{"$f":"'Informacje o klasie'!C48","v":0},{"$f":"'Informacje o klasie'!D48","v":0},null,null,null,null,null,null,null,null,null,null,0,null,null,null,null,null,null,null,null,null,null,0]
["0, 0",36,{"$f":"'Informacje o klasie'!C49","v":0},{"$f":"'Informacje o klasie'!D49","v":0},null,null,null,null,null,null,null,null,null,null,0,null,null,null,null,null,null,null,null,null,null,0]
["0, 0",37,{"$f":"'Informacje o klasie'!C50","v":0},{"$f":"'Informacje o klasie'!D50","v":0},null,null,null,null,null,null,null,null,null,null,0,null,null,null,null,null,null,null,null,null,null,0]
["0, 0",38,{"$f":"'Informacje o klasie'!C51","v":0},{"$f":"'Informacje o klasie'!D51","v":0},null,null,null,null,null,null,null,null,null,null,0,null,null,null,null,null,null,null,null,null,null,0]
["0, 0",39,{"$f":"'Informacje o klasie'!C52","v":0},{"$f":"'Informacje o klasie'!D52","v":0},null,null,null,null,null,null,null,null,null,null,0,null,null,null,null,null,null,null,null,null,null,0]
["0, 0",40,{"$f":"'Informacje o klasie'!C53","v":0},{"$f":"'Informacje o klasie'!D53","v":0},null,null,null,null,null,null,null,null,null,null,0,null,null,null,null,null,null,null,null,null,null,0]
["0, 0",41,{"$f":"'Informacje o klasie'!C54","v":0},{"$f":"'Informacje o klasie'!D54","v":0},null,null,null,null,null,null,null,null,null,null,0,null,null,null,null,null,null,null,null,null,null,0]
["0, 0",42,{"$f":"'Informacje o klasie'!C55","v":0},{"$f":"'Informacje o klasie'!D55","v":0},null,null,null,null,null,null,null,null,null,null,0,null,null,null,null,null,null,null,null,null,null,0]
["0, 0",43,{"$f":"'Informacje o klasie'!C56","v":0},{"$f":"'Informacje o klasie'!D56","v":0},null,null,null,null,null,null,null,null,null,null,0,null,null,null,null,null,null,null,null,null,null,0]
["0, 0",44,{"$f":"'Informacje o klasie'!C57","v":0},{"$f":"'Informacje o klasie'!D57","v":0},null,null,null,null,null,null,null,null,null,null,0,null,null,null,null,null,null,null,null,null,null,0]
["0, 0",45,{"$f":"'Informacje o klasie'!C58","v":0},{"$f":"'Informacje o klasie'!D58","v":0},null,null,null,null,null,null,null,null,null,null,0,null,null,null,null,null,null,null,null,null,null,0]
["0, 0",46,{"$f":"'Informacje o klasie'!C59","v":0},{"$f":"'Informacje o klasie'!D59","v":0},null,null,null,null,null,null,null,null,null,null,0,null,null,null,null,null,null,null,null,null,null,0]
["0, 0",47,{"$f":"'Informacje o klasie'!C60","v":0},{"$f":"'Informacje o klasie'!D60","v":0},null,null,null,null,null,null,null,null,null,null,0,null,null,null,null,null,null,null,null,null,null,0]
["0, 0",48,{"$f":"'Informacje o klasie'!C61","v":0},{"$f":"'Informacje o klasie'!D61","v":0},null,null,null,null,null,null,null,null,null,null,0,null,null,null,null,null,null,null,null,null,null,0]
["0, 0",49,{"$f":"'Informacje o klasie'!C62","v":0},{"$f":"'Informacje o klasie'!D62","v":0},null,null,null,null,null,null,null,null,null,null,0,null,null,null,null,null,null,null,null,null,null,0]
["0, 0",50,{"$f":"'Informacje o klasie'!C63","v":0},{"$f":"'Informacje o klasie'!D63","v":0},null,null,null,null,null,null,null,null,null,null,0,null,null,null,null,null,null,null,null,null,null,0]
["0, 0",51,{"$f":"'Informacje o klasie'!C64","v":0},{"$f":"'Informacje o klasie'!D64","v":0},null,null,null,null,null,null,null,null,null,null,0,null,null,null,null,null,null,null,null,null,null,0]
["0, 0",52,{"$f":"'Informacje o klasie'!C65","v":0},{"$f":"'Informacje o klasie'!D65","v":0},null,null,null,null,null,null,null,null,null,null,0,null,null,null,null,null,null,null,null,null,null,0]
["0, 0",53,{"$f":"'Informacje o klasie'!C66","v":0},{"$f":"'Informacje o klasie'!D66","v":0},null,null,null,null,null,null,null,null,null,null,0,null,null,null,null,null,null,null,null,null,null,0]
["0, 0",54,{"$f":"'Informacje o klasie'!C67","v":0},{"$f":"'Informacje o klasie'!D67","v":0},null,null,null,null,null,null,null,null,null,null,0,null,null,null,null,null,null,null,null,null,null,0]
["0, 0",55,{"$f":"'Informacje o klasie'!C68","v":0},{"$f":"'Informacje o klasie'!D68","v":0},null,null,null,null,null,null,null,null,null,null,0,null,null,null,null,null,null,null,null,null,null,0]
["0, 0",56,{"$f":"'Informacje o klasie'!C69","v":0},{"$f":"'Informacje o klasie'!D69","v":0},null,null,null,null,null,null,null,null,null,null,0,null,null,null,null,null,null,null,null,null,null,0]
["0, 0",57,{"$f":"'Informacje o klasie'!C70","v":0},{"$f":"'Informacje o klasie'!D70","v":0},null,null,null,null,null,null,null,null,null,null,0,null,null,null,null,null,null,null,null,null,null,0]
["0, 0",58,{"$f":"'Informacje o klasie'!C71","v":0},{"$f":"'Informacje o klasie'!D71","v":0},null,null,null,null,null,null,null,null,null,null,0,null,null,null,null,null,null,null,null,null,null,0]
["0, 0",59,{"$f":"'Informacje o klasie'!C72","v":0},{"$f":"'Informacje o klasie'!D72","v":0},null,null,null,null,null,null,null,null,null,null,0,null,null,null,null,null,null,null,null,null,null,0]
["0, 0",60,{"$f":"'Informacje o klasie'!C73","v":0},{"$f":"'Informacje o klasie'!D73","v":0},null,null,null,null,null,null,null,null,null,null,0,null,null,null,null,null,null,null,null,null,null,0]
["0, 0",61,{"$f":"'Informacje o klasie'!C74","v":0},{"$f":"'Informacje o klasie'!D74","v":0},null,null,null,null,null,null,null,null,null,null,0,null,null,null,null,null,null,null,null,null,null,0]
["0, 0",62,{"$f":"'Informacje o klasie'!C75","v":0},{"$f":"'Informacje o klasie'!D75","v":0},null,null,null,null,null,null,null,null,null,null,0,null,null,null,null,null,null,null,null,null,null,0]
["0, 0",63,{"$f":"'Informacje o klasie'!C76","v":0},{"$f":"'Informacje o klasie'!D76","v":0},null,null,null,null,null,null,null,null,null,null,0,null,null,null,null,null,null,null,null,null,null,0]
["0, 0",64,{"$f":"'Informacje o klasie'!C77","v":0},{"$f":"'Informacje o klasie'!D77","v":0},null,null,null,null,null,null,null,null,null,null,0,null,null,null,null,null,null,null,null,null,null,0]
["0, 0",65,{"$f":"'Informacje o klasie'!C78","v":0},{"$f":"'Informacje o klasie'!D78","v":0},null,null,null,null,null,null,null,null,null,null,0,null,null,null,null,null,null,null,null,null,null,0]
[{"$f":"C75&\", \"&D75","v":"0, 0"},66,{"$f":"'Informacje o klasie'!C79","v":0},{"$f":"'Informacje o klasie'!D79","v":0},null,null,null,null,null,null,null,null,null,null,{"$f":"O190","v":0},null,null,null,null,null,null,null,null,null,null,{"$f":"Z190","v":0}]
["0, 0",67,{"$f":"'Informacje o klasie'!C80","v":0},{"$f":"'Informacje o klasie'!D80","v":0},null,null,null,null,null,null,null,null,null,null,0,null,null,null,null,null,null,null,null,null,null,0]
["0, 0",68,{"$f":"'Informacje o klasie'!C81","v":0},{"$f":"'Informacje o klasie'!D81","v":0},null,null,null,null,null,null,null,null,null,null,0,null,null,null,null,null,null,null,null,null,null,0]
["0, 0",69,{"$f":"'Informacje o klasie'!C82","v":0},{"$f":"'Informacje o klasie'!D82","v":0},null,null,null,null,null,null,null,null,null,null,0,null,null,null,null,null,null,null,null,null,null,0]
["0, 0",70,{"$f":"'Informacje o klasie'!C83","v":0},{"$f":"'Informacje o klasie'!D83","v":0},null,null,null,null,null,null,null,null,null,null,0,null,null,null,null,null,null,null,null,null,null,0]
["0, 0",71,{"$f":"'Informacje o klasie'!C84","v":0},{"$f":"'Informacje o klasie'!D84","v":0},null,null,null,null,null,null,null,null,null,null,0,null,null,null,null,null,null,null,null,null,null,0]
["0, 0",72,{"$f":"'Informacje o klasie'!C85","v":0},{"$f":"'Informacje o klasie'!D85","v":0},null,null,null,null,null,null,null,null,null,null,0,null,null,null,null,null,null,null,null,null,null,0]
["0, 0",73,{"$f":"'Informacje o klasie'!C86","v":0},{"$f":"'Informacje o klasie'!D86","v":0},null,null,null,null,null,null,null,null,null,null,0,null,null,null,null,null,null,null,null,null,null,0]
["0, 0",74,{"$f":"'Informacje o klasie'!C87","v":0},{"$f":"'Informacje o klasie'!D87","v":0},null,null,null,null,null,null,null,null,null,null,0,null,null,null,null,null,null,null,null,null,null,0]
["0, 0",75,{"$f":"'Informacje o klasie'!C88","v":0},{"$f":"'Informacje o klasie'!D88","v":0},null,null,null,null,null,null,null,null,null,null,0,null,null,null,null,null,null,null,null,null,null,0]
["0, 0",76,{"$f":"'Informacje o klasie'!C89","v":0},{"$f":"'Informacje o klasie'!D89","v":0},null,null,null,null,null,null,null,null,null,null,0,null,null,null,null,null,null,null,null,null,null,0]
["0, 0",77,{"$f":"'Informacje o klasie'!C90","v":0},{"$f":"'Informacje o klasie'!D90","v":0},null,null,null,null,null,null,null,null,null,null,0,null,null,null,null,null,null,null,null,null,null,0]
["0, 0",78,{"$f":"'Informacje o klasie'!C91","v":0},{"$f":"'Informacje o klasie'!D91","v":0},null,null,null,null,null,null,null,null,null,null,0,null,null,null,null,null,null,null,null,null,null,0]
["0, 0",79,{"$f":"'Informacje o klasie'!C92","v":0},{"$f":"'Informacje o klasie'!D92","v":0},null,null,null,null,null,null,null,null,null,null,0,null,null,null,null,null,null,null,null,null,null,0]
["0, 0",80,{"$f":"'Informacje o klasie'!C93","v":0},{"$f":"'Informacje o klasie'!D93","v":0},null,null,null,null,null,null,null,null,null,null,0,null,null,null,null,null,null,null,null,null,null,0]
["0, 0",81,{"$f":"'Informacje o klasie'!C94","v":0},{"$f":"'Informacje o klasie'!D94","v":0},null,null,null,null,null,null,null,null,null,null,0,null,null,null,null,null,null,null,null,null,null,0]
["0, 0",82,{"$f":"'Informacje o klasie'!C95","v":0},{"$f":"'Informacje o klasie'!D95","v":0},null,null,null,null,null,null,null,null,null,null,0,null,null,null,null,null,null,null,null,null,null,0]
["0, 0",83,{"$f":"'Informacje o klasie'!C96","v":0},{"$f":"'Informacje o klasie'!D96","v":0},null,null,null,null,null,null,null,null,null,null,0,null,null,null,null,null,null,null,null,null,null,0]
["0, 0",84,{"$f":"'Informacje o klasie'!C97","v":0},{"$f":"'Informacje o klasie'!D97","v":0},null,null,null,null,null,null,null,null,null,null,0,null,null,null,null,null,null,null,null,null,null,0]
["0, 0",85,{"$f":"'Informacje o klasie'!C98","v":0},{"$f":"'Informacje o klasie'!D98","v":0},null,null,null,null,null,null,null,null,null,null,0,null,null,null,null,null,null,null,null,null,null,0]
["0, 0",86,{"$f":"'Informacje o klasie'!C99","v":0},{"$f":"'Informacje o klasie'!D99","v":0},null,null,null,null,null,null,null,null,null,null,0,null,null,null,null,null,null,null,null,null,null,0]
["0, 0",87,{"$f":"'Informacje o klasie'!C100","v":0},{"$f":"'Informacje o klasie'!D100","v":0},null,null,null,null,null,null,null,null,null,null,0,null,null,null,null,null,null,null,null,null,null,0]
["0, 0",88,{"$f":"'Informacje o klasie'!C101","v":0},{"$f":"'Informacje o klasie'!D101","v":0},null,null,null,null,null,null,null,null,null,null,0,null,null,null,null,null,null,null,null,null,null,0]
["0, 0",89,{"$f":"'Informacje o klasie'!C102","v":0},{"$f":"'Informacje o klasie'!D102","v":0},null,null,null,null,null,null,null,null,null,null,0,null,null,null,null,null,null,null,null,null,null,0]
["0, 0",90,{"$f":"'Informacje o klasie'!C103","v":0},{"$f":"'Informacje o klasie'!D103","v":0},null,null,null,null,null,null,null,null,null,null,0,null,null,null,null,null,null,null,null,null,null,0]
["0, 0",91,{"$f":"'Informacje o klasie'!C104","v":0},{"$f":"'Informacje o klasie'!D104","v":0},null,null,null,null,null,null,null,null,null,null,0,null,null,null,null,null,null,null,null,null,null,0]
["0, 0",92,{"$f":"'Informacje o klasie'!C105","v":0},{"$f":"'Informacje o klasie'!D105","v":0},null,null,null,null,null,null,null,null,null,null,0,null,null,null,null,null,null,null,null,null,null,0]
["0, 0",93,{"$f":"'Informacje o klasie'!C106","v":0},{"$f":"'Informacje o klasie'!D106","v":0},null,null,null,null,null,null,null,null,null,null,0,null,null,null,null,null,null,null,null,null,null,0]
["0, 0",94,{"$f":"'Informacje o klasie'!C107","v":0},{"$f":"'Informacje o klasie'!D107","v":0},null,null,null,null,null,null,null,null,null,null,0,null,null,null,null,null,null,null,null,null,null,0]
["0, 0",95,{"$f":"'Informacje o klasie'!C108","v":0},{"$f":"'Informacje o klasie'!D108","v":0},null,null,null,null,null,null,null,null,null,null,0,null,null,null,null,null,null,null,null,null,null,0]
["0, 0",96,{"$f":"'Informacje o klasie'!C109","v":0},{"$f":"'Informacje o klasie'!D109","v":0},null,null,null,null,null,null,null,null,null,null,0,null,null,null,null,null,null,null,null,null,null,0]
["0, 0",97,{"$f":"'Informacje o klasie'!C110","v":0},{"$f":"'Informacje o klasie'!D110","v":0},null,null,null,null,null,null,null,null,null,null,0,null,null,null,null,null,null,null,null,null,null,0]
["0, 0",98,{"$f":"'Informacje o klasie'!C111","v":0},{"$f":"'Informacje o klasie'!D111","v":0},null,null,null,null,null,null,null,null,null,null,0,null,null,null,null,null,null,null,null,null,null,0]
["0, 0",99,{"$f":"'Informacje o klasie'!C112","v":0},{"$f":"'Informacje o klasie'!D112","v":0},null,null,null,null,null,null,null,null,null,null,0,null,null,null,null,null,null,null,null,null,null,0]
[]
[]
[]
[null,null,null,null,"Calculation of results for chosen level"]
[null,null,null,null,"LISTENING",null,null,null,null,null,null,null,null,null,null,"READING"]
[null,null,null,null,1,2,3,4,5,6,7,8,9,10,"TOTAL",1,2,3,4,5,6,7,8,9,10,"TOTAL"]
[null,null,null,"Current level",{"$f":"IF('Informacje o klasie'!$C$5='Wyniki z Sekcji 1'!$D$116,E116,\nIF('Informacje o klasie'!$C$5='Wyniki z Sekcji 1'!$D$117,E117,\nIF('Informacje o klasie'!$C$5='Wyniki z Sekcji 1'!$D$118,E118,\nIF('Informacje o klasie'!$C$5='Wyniki z Sekcji 1'!$D$119,E119,\nIF('Informacje o klasie'!$C$5='Wyniki z Sekcji 1'!$D$120,E120,\n\"No level selected\")))))","v":"B"},{"$f":"IF('Informacje o klasie'!$C$5='Wyniki z Sekcji 1'!$D$116,F116,\nIF('Informacje o klasie'!$C$5='Wyniki z Sekcji 1'!$D$117,F117,\nIF('Informacje o klasie'!$C$5='Wyniki z Sekcji 1'!$D$118,F118,\nIF('Informacje o klasie'!$C$5='Wyniki z Sekcji 1'!$D$119,F119,\nIF('Informacje o klasie'!$C$5='Wyniki z Sekcji 1'!$D$120,F120,\n\"No level selected\")))))","v":"A"},{"$f":"IF('Informacje o klasie'!$C$5='Wyniki z Sekcji 1'!$D$116,G116,\nIF('Informacje o klasie'!$C$5='Wyniki z Sekcji 1'!$D$117,G117,\nIF('Informacje o klasie'!$C$5='Wyniki z Sekcji 1'!$D$118,G118,\nIF('Informacje o klasie'!$C$5='Wyniki z Sekcji 1'!$D$119,G119,\nIF('Informacje o klasie'!$C$5='Wyniki z Sekcji 1'!$D$120,G120,\n\"No level selected\")))))","v":"C"},{"$f":"IF('Informacje o klasie'!$C$5='Wyniki z Sekcji 1'!$D$116,H116,\nIF('Informacje o klasie'!$C$5='Wyniki z Sekcji 1'!$D$117,H117,\nIF('Informacje o klasie'!$C$5='Wyniki z Sekcji 1'!$D$118,H118,\nIF('Informacje o klasie'!$C$5='Wyniki z Sekcji 1'!$D$119,H119,\nIF('Informacje o klasie'!$C$5='Wyniki z Sekcji 1'!$D$120,H120,\n\"No level selected\")))))","v":"C"},{"$f":"IF('Informacje o klasie'!$C$5='Wyniki z Sekcji 1'!$D$116,I116,\nIF('Informacje o klasie'!$C$5='Wyniki z Sekcji 1'!$D$117,I117,\nIF('Informacje o klasie'!$C$5='Wyniki z Sekcji 1'!$D$118,I118,\nIF('Informacje o klasie'!$C$5='Wyniki z Sekcji 1'!$D$119,I119,\nIF('Informacje o klasie'!$C$5='Wyniki z Sekcji 1'!$D$120,I120,\n\"No level selected\")))))","v":"B"},{"$f":"IF('Informacje o klasie'!$C$5='Wyniki z Sekcji 1'!$D$116,J116,\nIF('Informacje o klasie'!$C$5='Wyniki z Sekcji 1'!$D$117,J117,\nIF('Informacje o klasie'!$C$5='Wyniki z Sekcji 1'!$D$118,J118,\nIF('Informacje o klasie'!$C$5='Wyniki z Sekcji 1'!$D$119,J119,\nIF('Informacje o klasie'!$C$5='Wyniki z Sekcji 1'!$D$120,J120,\n\"No level selected\")))))","v":"A"},{"$f":"IF('Informacje o klasie'!$C$5='Wyniki z Sekcji 1'!$D$116,K116,\nIF('Informacje o klasie'!$C$5='Wyniki z Sekcji 1'!$D$117,K117,\nIF('Informacje o klasie'!$C$5='Wyniki z Sekcji 1'!$D$118,K118,\nIF('Informacje o klasie'!$C$5='Wyniki z Sekcji 1'!$D$119,K119,\nIF('Informacje o klasie'!$C$5='Wyniki z Sekcji 1'!$D$120,K120,\n\"No level selected\")))))","v":"F"},{"$f":"IF('Informacje o klasie'!$C$5='Wyniki z Sekcji 1'!$D$116,L116,\nIF('Informacje o klasie'!$C$5='Wyniki z Sekcji 1'!$D$117,L117,\nIF('Informacje o klasie'!$C$5='Wyniki z Sekcji 1'!$D$118,L118,\nIF('Informacje o klasie'!$C$5='Wyniki z Sekcji 1'!$D$119,L119,\nIF('Informacje o klasie'!$C$5='Wyniki z Sekcji 1'!$D$120,L120,\n\"No level selected\")))))","v":"P"},{"$f":"IF('Informacje o klasie'!$C$5='Wyniki z Sekcji 1'!$D$116,M116,\nIF('Informacje o klasie'!$C$5='Wyniki z Sekcji 1'!$D$117,M117,\nIF('Informacje o klasie'!$C$5='Wyniki z Sekcji 1'!$D$118,M118,\nIF('Informacje o klasie'!$C$5='Wyniki z Sekcji 1'!$D$119,M119,\nIF('Informacje o klasie'!$C$5='Wyniki z Sekcji 1'!$D$120,M120,\n\"No level selected\")))))","v":"F"},{"$f":"IF('Informacje o klasie'!$C$5='Wyniki z Sekcji 1'!$D$116,N116,\nIF('Informacje o klasie'!$C$5='Wyniki z Sekcji 1'!$D$117,N117,\nIF('Informacje o klasie'!$C$5='Wyniki z Sekcji 1'!$D$118,N118,\nIF('Informacje o klasie'!$C$5='Wyniki z Sekcji 1'!$D$119,N119,\nIF('Informacje o klasie'!$C$5='Wyniki z Sekcji 1'!$D$120,N120,\n\"No level selected\")))))","v":"P"},10,{"$f":"IF('Informacje o klasie'!$C$5='Wyniki z Sekcji 1'!$D$116,P116,\nIF('Informacje o klasie'!$C$5='Wyniki z Sekcji 1'!$D$117,P117,\nIF('Informacje o klasie'!$C$5='Wyniki z Sekcji 1'!$D$118,P118,\nIF('Informacje o klasie'!$C$5='Wyniki z Sekcji 1'!$D$119,P119,\nIF('Informacje o klasie'!$C$5='Wyniki z Sekcji 1'!$D$120,P120,\n\"No level selected\")))))","v":"B"},{"$f":"IF('Informacje o klasie'!$C$5='Wyniki z Sekcji 1'!$D$116,Q116,\nIF('Informacje o klasie'!$C$5='Wyniki z Sekcji 1'!$D$117,Q117,\nIF('Informacje o klasie'!$C$5='Wyniki z Sekcji 1'!$D$118,Q118,\nIF('Informacje o klasie'!$C$5='Wyniki z Sekcji 1'!$D$119,Q119,\nIF('Informacje o klasie'!$C$5='Wyniki z Sekcji 1'!$D$120,Q120,\n\"No level selected\")))))","v":"A"},{"$f":"IF('Informacje o klasie'!$C$5='Wyniki z Sekcji 1'!$D$116,R116,\nIF('Informacje o klasie'!$C$5='Wyniki z Sekcji 1'!$D$117,R117,\nIF('Informacje o klasie'!$C$5='Wyniki z Sekcji 1'!$D$118,R118,\nIF('Informacje o klasie'!$C$5='Wyniki z Sekcji 1'!$D$119,R119,\nIF('Informacje o klasie'!$C$5='Wyniki z Sekcji 1'!$D$120,R120,\n\"No level selected\")))))","v":"C"},{"$f":"IF('Informacje o klasie'!$C$5='Wyniki z Sekcji 1'!$D$116,S116,\nIF('Informacje o klasie'!$C$5='Wyniki z Sekcji 1'!$D$117,S117,\nIF('Informacje o klasie'!$C$5='Wyniki z Sekcji 1'!$D$118,S118,\nIF('Informacje o klasie'!$C$5='Wyniki z Sekcji 1'!$D$119,S119,\nIF('Informacje o klasie'!$C$5='Wyniki z Sekcji 1'!$D$120,S120,\n\"No level selected\")))))","v":"B"},{"$f":"IF('Informacje o klasie'!$C$5='Wyniki z Sekcji 1'!$D$116,T116,\nIF('Informacje o klasie'!$C$5='Wyniki z Sekcji 1'!$D$117,T117,\nIF('Informacje o klasie'!$C$5='Wyniki z Sekcji 1'!$D$118,T118,\nIF('Informacje o klasie'!$C$5='Wyniki z Sekcji 1'!$D$119,T119,\nIF('Informacje o klasie'!$C$5='Wyniki z Sekcji 1'!$D$120,T120,\n\"No level selected\")))))","v":"B"},{"$f":"IF('Informacje o klasie'!$C$5='Wyniki z Sekcji 1'!$D$116,U116,\nIF('Informacje o klasie'!$C$5='Wyniki z Sekcji 1'!$D$117,U117,\nIF('Informacje o klasie'!$C$5='Wyniki z Sekcji 1'!$D$118,U118,\nIF('Informacje o klasie'!$C$5='Wyniki z Sekcji 1'!$D$119,U119,\nIF('Informacje o klasie'!$C$5='Wyniki z Sekcji 1'!$D$120,U120,\n\"No level selected\")))))","v":"P"},{"$f":"IF('Informacje o klasie'!$C$5='Wyniki z Sekcji 1'!$D$116,V116,\nIF('Informacje o klasie'!$C$5='Wyniki z Sekcji 1'!$D$117,V117,\nIF('Informacje o klasie'!$C$5='Wyniki z Sekcji 1'!$D$118,V118,\nIF('Informacje o klasie'!$C$5='Wyniki z Sekcji 1'!$D$119,V119,\nIF('Informacje o klasie'!$C$5='Wyniki z Sekcji 1'!$D$120,V120,\n\"No level selected\")))))","v":"P"},{"$f":"IF('Informacje o klasie'!$C$5='Wyniki z Sekcji 1'!$D$116,W116,\nIF('Informacje o klasie'!$C$5='Wyniki z Sekcji 1'!$D$117,W117,\nIF('Informacje o klasie'!$C$5='Wyniki z Sekcji 1'!$D$118,W118,\nIF('Informacje o klasie'!$C$5='Wyniki z Sekcji 1'!$D$119,W119,\nIF('Informacje o klasie'!$C$5='Wyniki z Sekcji 1'!$D$120,W120,\n\"No level selected\")))))","v":"F"},{"$f":"IF('Informacje o klasie'!$C$5='Wyniki z Sekcji 1'!$D$116,X116,\nIF('Informacje o klasie'!$C$5='Wyniki z Sekcji 1'!$D$117,X117,\nIF('Informacje o klasie'!$C$5='Wyniki z Sekcji 1'!$D$118,X118,\nIF('Informacje o klasie'!$C$5='Wyniki z Sekcji 1'!$D$119,X119,\nIF('Informacje o klasie'!$C$5='Wyniki z Sekcji 1'!$D$120,X120,\n\"No level selected\")))))","v":"F"},{"$f":"IF('Informacje o klasie'!$C$5='Wyniki z Sekcji 1'!$D$116,Y116,\nIF('Informacje o klasie'!$C$5='Wyniki z Sekcji 1'!$D$117,Y117,\nIF('Informacje o klasie'!$C$5='Wyniki z Sekcji 1'!$D$118,Y118,\nIF('Informacje o klasie'!$C$5='Wyniki z Sekcji 1'!$D$119,Y119,\nIF('Informacje o klasie'!$C$5='Wyniki z Sekcji 1'!$D$120,Y120,\n\"No level selected\")))))","v":"P"},10]
[null,null,null,"Test diagnostyczny 5","B","A","C","C","B","A","F","P","F","P",10,"B","A","C","B","B","P","P","F","F","P",10]
[null,null,null,{"$f":"Validation!J3","v":0},"B","A","C","C","B","A","T","T","F","T",10,"A","A","C","B","C","D","B","C","D","A",10]
[null,null,null,{"$f":"Validation!J4","v":0},"B","C","B","B","C","F","T","T","T","F",10,"B","B","C","A","D","B","A","A","D","B",10]
[null,null,null,{"$f":"Validation!J5","v":0},"B","B","C","A","A","B","B","E","A","C",10,"D","A","D","B","B","A","C","C","B","A",10]
[null,null,null,{"$f":"Validation!J6","v":0},"A","B","C","A","B","B","B","A","C","D",10,"B","D","D","A","B","C","B","A","C","A",10]
[null,null,null,"Choice range","AC","AC","AC","AC","AC","AC","TF","TF","TF","TF",null,"AC","AC","AC","AC","AC","TF","TF","TF","TF","TF"]
[null,null,null,null,"Calculation of total score by student"]
[null,null,null,null,"LISTENING",null,null,null,null,null,null,null,null,null,null,"READING"]
[null,"Question:",null,null,1,2,3,4,5,6,7,8,9,10,"TOTAL",1,2,3,4,5,6,7,8,9,10,"TOTAL"]
[null,1,{"$f":"C10","v":0},{"$f":"D10","v":0},{"$f":"IF(E10=E$115,1,0)","v":0},{"$f":"IF(F10=F$115,1,0)","v":0},0,0,0,0,0,0,0,0,{"$f":"SUM(E125:N125)","v":0},{"$f":"IF(P10=P$115,1,0)","v":0},{"$f":"IF(Q10=Q$115,1,0)","v":0},0,0,0,0,0,0,0,0,{"$f":"SUM(P125:Y125)","v":0}]
[null,2,{"$f":"C11","v":0},0,{"$f":"IF(E11=E$115,1,0)","v":0},{"$f":"IF(F11=F$115,1,0)","v":0},0,0,0,0,0,0,0,0,{"$f":"SUM(E126:N126)","v":0},{"$f":"IF(P11=P$115,1,0)","v":0},0,0,0,0,0,0,0,0,0,{"$f":"SUM(P126:Y126)","v":0}]
[null,3,{"$f":"C12","v":0},0,{"$f":"IF(E12=E$115,1,0)","v":0},0,0,0,0,0,0,0,0,0,0,{"$f":"IF(P12=P$115,1,0)","v":0},0,0,0,0,0,0,0,0,0,0]
[null,4,{"$f":"C13","v":0},0,{"$f":"IF(E13=E$115,1,0)","v":0},0,0,0,0,0,0,0,0,0,0,{"$f":"IF(P13=P$115,1,0)","v":0},0,0,0,0,0,0,0,0,0,0]
[null,5,{"$f":"C14","v":0},0,{"$f":"IF(E14=E$115,1,0)","v":0},0,0,0,0,0,0,0,0,0,0,{"$f":"IF(P14=P$115,1,0)","v":0},0,0,0,0,0,0,0,0,0,0]
[null,6,{"$f":"C15","v":0},0,{"$f":"IF(E15=E$115,1,0)","v":0},0,0,0,0,0,0,0,0,0,0,{"$f":"IF(P15=P$115,1,0)","v":0},0,0,0,0,0,0,0,0,0,0]
[null,7,{"$f":"C16","v":0},0,{"$f":"IF(E16=E$115,1,0)","v":0},0,0,0,0,0,0,0,0,0,0,{"$f":"IF(P16=P$115,1,0)","v":0},0,0,0,0,0,0,0,0,0,0]
[null,8,{"$f":"C17","v":0},0,{"$f":"IF(E17=E$115,1,0)","v":0},0,0,0,0,0,0,0,0,0,0,{"$f":"IF(P17=P$115,1,0)","v":0},0,0,0,0,0,0,0,0,0,0]
[null,9,{"$f":"C18","v":0},0,{"$f":"IF(E18=E$115,1,0)","v":0},0,0,0,0,0,0,0,0,0,0,{"$f":"IF(P18=P$115,1,0)","v":0},0,0,0,0,0,0,0,0,0,0]
[null,10,{"$f":"C19","v":0},0,{"$f":"IF(E19=E$115,1,0)","v":0},0,0,0,0,0,0,0,0,0,0,{"$f":"IF(P19=P$115,1,0)","v":0},0,0,0,0,0,0,0,0,0,0]
[null,11,{"$f":"C20","v":0},0,{"$f":"IF(E20=E$115,1,0)","v":0},0,0,0,0,0,0,0,0,0,0,{"$f":"IF(P20=P$115,1,0)","v":0},0,0,0,0,0,0,0,0,0,0]
[null,12,{"$f":"C21","v":0},0,{"$f":"IF(E21=E$115,1,0)","v":0},0,0,0,0,0,0,0,0,0,0,{"$f":"IF(P21=P$115,1,0)","v":0},0,0,0,0,0,0,0,0,0,0]
[null,13,{"$f":"C22","v":0},0,{"$f":"IF(E22=E$115,1,0)","v":0},0,0,0,0,0,0,0,0,0,0,{"$f":"IF(P22=P$115,1,0)","v":0},0,0,0,0,0,0,0,0,0,0]
[null,14,{"$f":"C23","v":0},0,{"$f":"IF(E23=E$115,1,0)","v":0},0,0,0,0,0,0,0,0,0,0,{"$f":"IF(P23=P$115,1,0)","v":0},0,0,0,0,0,0,0,0,0,0]
[null,15,{"$f":"C24","v":0},0,{"$f":"IF(E24=E$115,1,0)","v":0},0,0,0,0,0,0,0,0,0,0,{"$f":"IF(P24=P$115,1,0)","v":0},0,0,0,0,0,0,0,0,0,0]
[null,16,{"$f":"C25","v":0},0,{"$f":"IF(E25=E$115,1,0)","v":0},0,0,0,0,0,0,0,0,0,0,{"$f":"IF(P25=P$115,1,0)","v":0},0,0,0,0,0,0,0,0,0,0]
[null,17,{"$f":"C26","v":0},0,{"$f":"IF(E26=E$115,1,0)","v":0},0,0,0,0,0,0,0,0,0,0,{"$f":"IF(P26=P$115,1,0)","v":0},0,0,0,0,0,0,0,0,0,0]
[null,18,{"$f":"C27","v":0},0,{"$f":"IF(E27=E$115,1,0)","v":0},0,0,0,0,0,0,0,0,0,0,{"$f":"IF(P27=P$115,1,0)","v":0},0,0,0,0,0,0,0,0,0,0]
[null,19,{"$f":"C28","v":0},0,{"$f":"IF(E28=E$115,1,0)","v":0},0,0,0,0,0,0,0,0,0,0,{"$f":"IF(P28=P$115,1,0)","v":0},0,0,0,0,0,0,0,0,0,0]
[null,20,{"$f":"C29","v":0},0,{"$f":"IF(E29=E$115,1,0)","v":0},0,0,0,0,0,0,0,0,0,0,{"$f":"IF(P29=P$115,1,0)","v":0},0,0,0,0,0,0,0,0,0,0]
[null,21,{"$f":"C30","v":0},0,{"$f":"IF(E30=E$115,1,0)","v":0},0,0,0,0,0,0,0,0,0,0,{"$f":"IF(P30=P$115,1,0)","v":0},0,0,0,0,0,0,0,0,0,0]
[null,22,{"$f":"C31","v":0},0,{"$f":"IF(E31=E$115,1,0)","v":0},0,0,0,0,0,0,0,0,0,0,{"$f":"IF(P31=P$115,1,0)","v":0},0,0,0,0,0,0,0,0,0,0]
[null,23,{"$f":"C32","v":0},0,{"$f":"IF(E32=E$115,1,0)","v":0},0,0,0,0,0,0,0,0,0,0,{"$f":"IF(P32=P$115,1,0)","v":0},0,0,0,0,0,0,0,0,0,0]
[null,24,{"$f":"C33","v":0},0,{"$f":"IF(E33=E$115,1,0)","v":0},0,0,0,0,0,0,0,0,0,0,{"$f":"IF(P33=P$115,1,0)","v":0},0,0,0,0,0,0,0,0,0,0]
[null,25,{"$f":"C34","v":0},0,{"$f":"IF(E34=E$115,1,0)","v":0},0,0,0,0,0,0,0,0,0,0,{"$f":"IF(P34=P$115,1,0)","v":0},0,0,0,0,0,0,0,0,0,0]
[null,26,{"$f":"C35","v":0},0,{"$f":"IF(E35=E$115,1,0)","v":0},0,0,0,0,0,0,0,0,0,0,{"$f":"IF(P35=P$115,1,0)","v":0},0,0,0,0,0,0,0,0,0,0]
[null,27,{"$f":"C36","v":0},0,{"$f":"IF(E36=E$115,1,0)","v":0},0,0,0,0,0,0,0,0,0,0,{"$f":"IF(P36=P$115,1,0)","v":0},0,0,0,0,0,0,0,0,0,0]
[null,28,{"$f":"C37","v":0},0,{"$f":"IF(E37=E$115,1,0)","v":0},0,0,0,0,0,0,0,0,0,0,{"$f":"IF(P37=P$115,1,0)","v":0},0,0,0,0,0,0,0,0,0,0]
[null,29,{"$f":"C38","v":0},0,{"$f":"IF(E38=E$115,1,0)","v":0},0,0,0,0,0,0,0,0,0,0,{"$f":"IF(P38=P$115,1,0)","v":0},0,0,0,0,0,0,0,0,0,0]
[null,30,{"$f":"C39","v":0},0,{"$f":"IF(E39=E$115,1,0)","v":0},0,0,0,0,0,0,0,0,0,0,{"$f":"IF(P39=P$115,1,0)","v":0},0,0,0,0,0,0,0,0,0,0]
[null,31,{"$f":"C40","v":0},0,{"$f":"IF(E40=E$115,1,0)","v":0},0,0,0,0,0,0,0,0,0,0,{"$f":"IF(P40=P$115,1,0)","v":0},0,0,0,0,0,0,0,0,0,0]
[null,32,{"$f":"C41","v":0},0,{"$f":"IF(E41=E$115,1,0)","v":0},0,0,0,0,0,0,0,0,0,0,{"$f":"IF(P41=P$115,1,0)","v":0},0,0,0,0,0,0,0,0,0,0]
[null,33,{"$f":"C42","v":0},0,{"$f":"IF(E42=E$115,1,0)","v":0},0,0,0,0,0,0,0,0,0,0,{"$f":"IF(P42=P$115,1,0)","v":0},0,0,0,0,0,0,0,0,0,0]
[null,34,{"$f":"C43","v":0},0,{"$f":"IF(E43=E$115,1,0)","v":0},0,0,0,0,0,0,0,0,0,0,{"$f":"IF(P43=P$115,1,0)","v":0},0,0,0,0,0,0,0,0,0,0]
[null,35,{"$f":"C44","v":0},0,{"$f":"IF(E44=E$115,1,0)","v":0},0,0,0,0,0,0,0,0,0,0,{"$f":"IF(P44=P$115,1,0)","v":0},0,0,0,0,0,0,0,0,0,0]
[null,36,{"$f":"C45","v":0},0,{"$f":"IF(E45=E$115,1,0)","v":0},0,0,0,0,0,0,0,0,0,0,{"$f":"IF(P45=P$115,1,0)","v":0},0,0,0,0,0,0,0,0,0,0]
[null,37,{"$f":"C46","v":0},0,{"$f":"IF(E46=E$115,1,0)","v":0},0,0,0,0,0,0,0,0,0,0,{"$f":"IF(P46=P$115,1,0)","v":0},0,0,0,0,0,0,0,0,0,0]
[null,38,{"$f":"C47","v":0},0,{"$f":"IF(E47=E$115,1,0)","v":0},0,0,0,0,0,0,0,0,0,0,{"$f":"IF(P47=P$115,1,0)","v":0},0,0,0,0,0,0,0,0,0,0]
[null,39,{"$f":"C48","v":0},0,{"$f":"IF(E48=E$115,1,0)","v":0},0,0,0,0,0,0,0,0,0,0,{"$f":"IF(P48=P$115,1,0)","v":0},0,0,0,0,0,0,0,0,0,0]
[null,40,{"$f":"C49","v":0},0,{"$f":"IF(E49=E$115,1,0)","v":0},0,0,0,0,0,0,0,0,0,0,{"$f":"IF(P49=P$115,1,0)","v":0},0,0,0,0,0,0,0,0,0,0]
[null,41,{"$f":"C50","v":0},0,{"$f":"IF(E50=E$115,1,0)","v":0},0,0,0,0,0,0,0,0,0,0,{"$f":"IF(P50=P$115,1,0)","v":0},0,0,0,0,0,0,0,0,0,0]
[null,42,{"$f":"C51","v":0},0,{"$f":"IF(E51=E$115,1,0)","v":0},0,0,0,0,0,0,0,0,0,0,{"$f":"IF(P51=P$115,1,0)","v":0},0,0,0,0,0,0,0,0,0,0]
[null,43,{"$f":"C52","v":0},0,{"$f":"IF(E52=E$115,1,0)","v":0},0,0,0,0,0,0,0,0,0,0,{"$f":"IF(P52=P$115,1,0)","v":0},0,0,0,0,0,0,0,0,0,0]
[null,44,{"$f":"C53","v":0},0,{"$f":"IF(E53=E$115,1,0)","v":0},0,0,0,0,0,0,0,0,0,0,{"$f":"IF(P53=P$115,1,0)","v":0},0,0,0,0,0,0,0,0,0,0]
[null,45,{"$f":"C54","v":0},0,{"$f":"IF(E54=E$115,1,0)","v":0},0,0,0,0,0,0,0,0,0,0,{"$f":"IF(P54=P$115,1,0)","v":0},0,0,0,0,0,0,0,0,0,0]
[null,46,{"$f":"C55","v":0},0,{"$f":"IF(E55=E$115,1,0)","v":0},0,0,0,0,0,0,0,0,0,0,{"$f":"IF(P55=P$115,1,0)","v":0},0,0,0,0,0,0,0,0,0,0]
[null,47,{"$f":"C56","v":0},0,{"$f":"IF(E56=E$115,1,0)","v":0},0,0,0,0,0,0,0,0,0,0,{"$f":"IF(P56=P$115,1,0)","v":0},0,0,0,0,0,0,0,0,0,0]
[null,48,{"$f":"C57","v":0},0,{"$f":"IF(E57=E$115,1,0)","v":0},0,0,0,0,0,0,0,0,0,0,{"$f":"IF(P57=P$115,1,0)","v":0},0,0,0,0,0,0,0,0,0,0]
[null,49,{"$f":"C58","v":0},0,{"$f":"IF(E58=E$115,1,0)","v":0},0,0,0,0,0,0,0,0,0,0,{"$f":"IF(P58=P$115,1,0)","v":0},0,0,0,0,0,0,0,0,0,0]
[null,50,{"$f":"C59","v":0},0,{"$f":"IF(E59=E$115,1,0)","v":0},0,0,0,0,0,0,0,0,0,0,{"$f":"IF(P59=P$115,1,0)","v":0},0,0,0,0,0,0,0,0,0,0]
[null,51,{"$f":"C60","v":0},0,{"$f":"IF(E60=E$115,1,0)","v":0},0,0,0,0,0,0,0,0,0,0,{"$f":"IF(P60=P$115,1,0)","v":0},0,0,0,0,0,0,0,0,0,0]
[null,52,{"$f":"C61","v":0},0,{"$f":"IF(E61=E$115,1,0)","v":0},0,0,0,0,0,0,0,0,0,0,{"$f":"IF(P61=P$115,1,0)","v":0},0,0,0,0,0,0,0,0,0,0]
[null,53,{"$f":"C62","v":0},0,{"$f":"IF(E62=E$115,1,0)","v":0},0,0,0,0,0,0,0,0,0,0,{"$f":"IF(P62=P$115,1,0)","v":0},0,0,0,0,0,0,0,0,0,0]
[null,54,{"$f":"C63","v":0},0,{"$f":"IF(E63=E$115,1,0)","v":0},0,0,0,0,0,0,0,0,0,0,{"$f":"IF(P63=P$115,1,0)","v":0},0,0,0,0,0,0,0,0,0,0]
[null,55,{"$f":"C64","v":0},0,{"$f":"IF(E64=E$115,1,0)","v":0},0,0,0,0,0,0,0,0,0,0,{"$f":"IF(P64=P$115,1,0)","v":0},0,0,0,0,0,0,0,0,0,0]
[null,56,{"$f":"C65","v":0},0,{"$f":"IF(E65=E$115,1,0)","v":0},0,0,0,0,0,0,0,0,0,0,{"$f":"IF(P65=P$115,1,0)","v":0},0,0,0,0,0,0,0,0,0,0]
[null,57,{"$f":"C66","v":0},0,{"$f":"IF(E66=E$115,1,0)","v":0},0,0,0,0,0,0,0,0,0,0,{"$f":"IF(P66=P$115,1,0)","v":0},0,0,0,0,0,0,0,0,0,0]
[null,58,{"$f":"C67","v":0},0,{"$f":"IF(E67=E$115,1,0)","v":0},0,0,0,0,0,0,0,0,0,0,{"$f":"IF(P67=P$115,1,0)","v":0},0,0,0,0,0,0,0,0,0,0]
[null,59,{"$f":"C68","v":0},0,{"$f":"IF(E68=E$115,1,0)","v":0},0,0,0,0,0,0,0,0,0,0,{"$f":"IF(P68=P$115,1,0)","v":0},0,0,0,0,0,0,0,0,0,0]
[null,60,{"$f":"C69","v":0},0,{"$f":"IF(E69=E$115,1,0)","v":0},0,0,0,0,0,0,0,0,0,0,{"$f":"IF(P69=P$115,1,0)","v":0},0,0,0,0,0,0,0,0,0,0]
[null,61,{"$f":"C70","v":0},0,{"$f":"IF(E70=E$115,1,0)","v":0},0,0,0,0,0,0,0,0,0,0,{"$f":"IF(P70=P$115,1,0)","v":0},0,0,0,0,0,0,0,0,0,0]
[null,62,{"$f":"C71","v":0},0,{"$f":"IF(E71=E$115,1,0)","v":0},0,0,0,0,0,0,0,0,0,0,{"$f":"IF(P71=P$115,1,0)","v":0},0,0,0,0,0,0,0,0,0,0]
[null,63,{"$f":"C72","v":0},0,{"$f":"IF(E72=E$115,1,0)","v":0},0,0,0,0,0,0,0,0,0,0,{"$f":"IF(P72=P$115,1,0)","v":0},0,0,0,0,0,0,0,0,0,0]
[null,64,{"$f":"C73","v":0},0,{"$f":"IF(E73=E$115,1,0)","v":0},0,0,0,0,0,0,0,0,0,0,{"$f":"IF(P73=P$115,1,0)","v":0},0,0,0,0,0,0,0,0,0,0]
[null,65,{"$f":"C74","v":0},0,{"$f":"IF(E74=E$115,1,0)","v":0},0,0,0,0,0,0,0,0,0,0,{"$f":"IF(P74=P$115,1,0)","v":0},0,0,0,0,0,0,0,0,0,0]
[null,66,{"$f":"C75","v":0},0,{"$f":"IF(E75=E$115,1,0)","v":0},0,0,0,0,0,0,0,0,0,{"$f":"SUM(E190:N190)","v":0},{"$f":"IF(P75=P$115,1,0)","v":0},0,0,0,0,0,0,0,0,0,{"$f":"SUM(P190:Y190)","v":0}]
[null,67,{"$f":"C76","v":0},0,{"$f":"IF(E76=E$115,1,0)","v":0},0,0,0,0,0,0,0,0,0,0,{"$f":"IF(P76=P$115,1,0)","v":0},0,0,0,0,0,0,0,0,0,0]
[null,68,{"$f":"C77","v":0},0,{"$f":"IF(E77=E$115,1,0)","v":0},0,0,0,0,0,0,0,0,0,0,{"$f":"IF(P77=P$115,1,0)","v":0},0,0,0,0,0,0,0,0,0,0]
[null,69,{"$f":"C78","v":0},0,{"$f":"IF(E78=E$115,1,0)","v":0},0,0,0,0,0,0,0,0,0,0,{"$f":"IF(P78=P$115,1,0)","v":0},0,0,0,0,0,0,0,0,0,0]
[null,70,{"$f":"C79","v":0},0,{"$f":"IF(E79=E$115,1,0)","v":0},0,0,0,0,0,0,0,0,0,0,{"$f":"IF(P79=P$115,1,0)","v":0},0,0,0,0,0,0,0,0,0,0]
[null,71,{"$f":"C80","v":0},0,{"$f":"IF(E80=E$115,1,0)","v":0},0,0,0,0,0,0,0,0,0,0,{"$f":"IF(P80=P$115,1,0)","v":0},0,0,0,0,0,0,0,0,0,0]
[null,72,{"$f":"C81","v":0},0,{"$f":"IF(E81=E$115,1,0)","v":0},0,0,0,0,0,0,0,0,0,0,{"$f":"IF(P81=P$115,1,0)","v":0},0,0,0,0,0,0,0,0,0,0]
[null,73,{"$f":"C82","v":0},0,{"$f":"IF(E82=E$115,1,0)","v":0},0,0,0,0,0,0,0,0,0,0,{"$f":"IF(P82=P$115,1,0)","v":0},0,0,0,0,0,0,0,0,0,0]
[null,74,{"$f":"C83","v":0},0,{"$f":"IF(E83=E$115,1,0)","v":0},0,0,0,0,0,0,0,0,0,0,{"$f":"IF(P83=P$115,1,0)","v":0},0,0,0,0,0,0,0,0,0,0]
[null,75,{"$f":"C84","v":0},0,{"$f":"IF(E84=E$115,1,0)","v":0},0,0,0,0,0,0,0,0,0,0,{"$f":"IF(P84=P$115,1,0)","v":0},0,0,0,0,0,0,0,0,0,0]
[null,76,{"$f":"C85","v":0},0,{"$f":"IF(E85=E$115,1,0)","v":0},0,0,0,0,0,0,0,0,0,0,{"$f":"IF(P85=P$115,1,0)","v":0},0,0,0,0,0,0,0,0,0,0]
[null,77,{"$f":"C86","v":0},0,{"$f":"IF(E86=E$115,1,0)","v":0},0,0,0,0,0,0,0,0,0,0,{"$f":"IF(P86=P$115,1,0)","v":0},0,0,0,0,0,0,0,0,0,0]
[null,78,{"$f":"C87","v":0},0,{"$f":"IF(E87=E$115,1,0)","v":0},0,0,0,0,0,0,0,0,0,0,{"$f":"IF(P87=P$115,1,0)","v":0},0,0,0,0,0,0,0,0,0,0]
[null,79,{"$f":"C88","v":0},0,{"$f":"IF(E88=E$115,1,0)","v":0},0,0,0,0,0,0,0,0,0,0,{"$f":"IF(P88=P$115,1,0)","v":0},0,0,0,0,0,0,0,0,0,0]
[null,80,{"$f":"C89","v":0},0,{"$f":"IF(E89=E$115,1,0)","v":0},0,0,0,0,0,0,0,0,0,0,{"$f":"IF(P89=P$115,1,0)","v":0},0,0,0,0,0,0,0,0,0,0]
[null,81,{"$f":"C90","v":0},0,{"$f":"IF(E90=E$115,1,0)","v":0},0,0,0,0,0,0,0,0,0,0,{"$f":"IF(P90=P$115,1,0)","v":0},0,0,0,0,0,0,0,0,0,0]
[null,82,{"$f":"C91","v":0},0,{"$f":"IF(E91=E$115,1,0)","v":0},0,0,0,0,0,0,0,0,0,0,{"$f":"IF(P91=P$115,1,0)","v":0},0,0,0,0,0,0,0,0,0,0]
[null,83,{"$f":"C92","v":0},0,{"$f":"IF(E92=E$115,1,0)","v":0},0,0,0,0,0,0,0,0,0,0,{"$f":"IF(P92=P$115,1,0)","v":0},0,0,0,0,0,0,0,0,0,0]
[null,84,{"$f":"C93","v":0},0,{"$f":"IF(E93=E$115,1,0)","v":0},0,0,0,0,0,0,0,0,0,0,{"$f":"IF(P93=P$115,1,0)","v":0},0,0,0,0,0,0,0,0,0,0]
[null,85,{"$f":"C94","v":0},0,{"$f":"IF(E94=E$115,1,0)","v":0},0,0,0,0,0,0,0,0,0,0,{"$f":"IF(P94=P$115,1,0)","v":0},0,0,0,0,0,0,0,0,0,0]
[null,86,{"$f":"C95","v":0},0,{"$f":"IF(E95=E$115,1,0)","v":0},0,0,0,0,0,0,0,0,0,0,{"$f":"IF(P95=P$115,1,0)","v":0},0,0,0,0,0,0,0,0,0,0]
[null,87,{"$f":"C96","v":0},0,{"$f":"IF(E96=E$115,1,0)","v":0},0,0,0,0,0,0,0,0,0,0,{"$f":"IF(P96=P$115,1,0)","v":0},0,0,0,0,0,0,0,0,0,0]
[null,88,{"$f":"C97","v":0},0,{"$f":"IF(E97=E$115,1,0)","v":0},0,0,0,0,0,0,0,0,0,0,{"$f":"IF(P97=P$115,1,0)","v":0},0,0,0,0,0,0,0,0,0,0]
[null,89,{"$f":"C98","v":0},0,{"$f":"IF(E98=E$115,1,0)","v":0},0,0,0,0,0,0,0,0,0,0,{"$f":"IF(P98=P$115,1,0)","v":0},0,0,0,0,0,0,0,0,0,0]
[null,90,{"$f":"C99","v":0},0,{"$f":"IF(E99=E$115,1,0)","v":0},0,0,0,0,0,0,0,0,0,0,{"$f":"IF(P99=P$115,1,0)","v":0},0,0,0,0,0,0,0,0,0,0]
[null,91,{"$f":"C100","v":0},0,{"$f":"IF(E100=E$115,1,0)","v":0},0,0,0,0,0,0,0,0,0,0,{"$f":"IF(P100=P$115,1,0)","v":0},0,0,0,0,0,0,0,0,0,0]
[null,92,{"$f":"C101","v":0},0,{"$f":"IF(E101=E$115,1,0)","v":0},0,0,0,0,0,0,0,0,0,0,{"$f":"IF(P101=P$115,1,0)","v":0},0,0,0,0,0,0,0,0,0,0]
[null,93,{"$f":"C102","v":0},0,{"$f":"IF(E102=E$115,1,0)","v":0},0,0,0,0,0,0,0,0,0,0,{"$f":"IF(P102=P$115,1,0)","v":0},0,0,0,0,0,0,0,0,0,0]
[null,94,{"$f":"C103","v":0},0,{"$f":"IF(E103=E$115,1,0)","v":0},0,0,0,0,0,0,0,0,0,0,{"$f":"IF(P103=P$115,1,0)","v":0},0,0,0,0,0,0,0,0,0,0]
[null,95,{"$f":"C104","v":0},0,{"$f":"IF(E104=E$115,1,0)","v":0},0,0,0,0,0,0,0,0,0,0,{"$f":"IF(P104=P$115,1,0)","v":0},0,0,0,0,0,0,0,0,0,0]
[null,96,{"$f":"C105","v":0},0,{"$f":"IF(E105=E$115,1,0)","v":0},0,0,0,0,0,0,0,0,0,0,{"$f":"IF(P105=P$115,1,0)","v":0},0,0,0,0,0,0,0,0,0,0]
[null,97,{"$f":"C106","v":0},0,{"$f":"IF(E106=E$115,1,0)","v":0},0,0,0,0,0,0,0,0,0,0,{"$f":"IF(P106=P$115,1,0)","v":0},0,0,0,0,0,0,0,0,0,0]
[null,98,{"$f":"C107","v":0},0,{"$f":"IF(E107=E$115,1,0)","v":0},0,0,0,0,0,0,0,0,0,0,{"$f":"IF(P107=P$115,1,0)","v":0},0,0,0,0,0,0,0,0,0,0]
[null,99,{"$f":"C108","v":0},0,{"$f":"IF(E108=E$115,1,0)","v":0},0,0,0,0,0,0,0,0,0,0,{"$f":"IF(P108=P$115,1,0)","v":0},0,0,0,0,0,0,0,0,0,0]
[null,null,null,"Total",{"$f":"SUM(E125:E223)","v":0},{"$f":"SUM(F125:F223)","v":0},0,0,0,0,0,0,0,0,{"$f":"SUM(O125:O223)","v":0},0,{"$f":"SUM(Q125:Q223)","v":0},{"$f":"SUM(R125:R223)","v":0},{"$f":"SUM(S125:S223)","v":0},{"$f":"SUM(T125:T223)","v":0},{"$f":"SUM(U125:U223)","v":0},{"$f":"SUM(V125:V223)","v":0},{"$f":"SUM(W125:W223)","v":0},{"$f":"SUM(X125:X223)","v":0},{"$f":"SUM(Y125:Y223)","v":0},{"$f":"SUM(Z125:Z223)","v":0}]
[null,null,null,"Average",{"$f":"(E224/'Informacje o klasie'!$C$11)","v":{"$error":"#DIV/0!"}},{"$f":"(F224/'Informacje o klasie'!$C$11)","v":{"$error":"#DIV/0!"}},{"$f":"(G224/'Informacje o klasie'!$C$11)","v":{"$error":"#DIV/0!"}},{"$f":"(H224/'Informacje o klasie'!$C$11)","v":{"$error":"#DIV/0!"}},{"$f":"(I224/'Informacje o klasie'!$C$11)","v":{"$error":"#DIV/0!"}},{"$f":"(J224/'Informacje o klasie'!$C$11)","v":{"$error":"#DIV/0!"}},{"$f":"(K224/'Informacje o klasie'!$C$11)","v":{"$error":"#DIV/0!"}},{"$f":"(L224/'Informacje o klasie'!$C$11)","v":{"$error":"#DIV/0!"}},{"$f":"(M224/'Informacje o klasie'!$C$11)","v":{"$error":"#DIV/0!"}},{"$f":"(N224/'Informacje o klasie'!$C$11)","v":{"$error":"#DIV/0!"}},null,{"$f":"P224/'Informacje o klasie'!$C$11","v":{"$error":"#DIV/0!"}},{"$f":"Q224/'Informacje o klasie'!$C$11","v":{"$error":"#DIV/0!"}},{"$f":"R224/'Informacje o klasie'!$C$11","v":{"$error":"#DIV/0!"}},{"$f":"S224/'Informacje o klasie'!$C$11","v":{"$error":"#DIV/0!"}},{"$f":"T224/'Informacje o klasie'!$C$11","v":{"$error":"#DIV/0!"}},{"$f":"U224/'Informacje o klasie'!$C$11","v":{"$error":"#DIV/0!"}},{"$f":"V224/'Informacje o klasie'!$C$11","v":{"$error":"#DIV/0!"}},{"$f":"W224/'Informacje o klasie'!$C$11","v":{"$error":"#DIV/0!"}},{"$f":"X224/'Informacje o klasie'!$C$11","v":{"$error":"#DIV/0!"}},{"$f":"Y224/'Informacje o klasie'!$C$11","v":{"$error":"#DIV/0!"}}]
[null,null,null,null,null,null,null,null,null,null,null,"Class average",null,null,{"$f":"ROUND(O224/'Informacje o klasie'!$C$11,0)","v":{"$error":"#DIV/0!"}},null,null,null,null,null,null,null,null,null,null,{"$f":"ROUND(Z224/'Informacje o klasie'!$C$11,0)","v":{"$error":"#DIV/0!"}}]

{"sheet":"Wyniki z Sekcji 2","index":4,"n_rows":226,"n_cols":21,"rows_kept":226,"cut":false,"hidden":false,"merged":[[122,1,122,3],[122,4,122,14],[122,18,122,20],[123,1,123,3],[7,1,7,3],[7,4,7,14],[8,1,8,3],[112,4,112,14],[112,18,112,20],[7,15,7,20]]}
[]
[null,"Test diagnostyczny 5"]
[null,{"$f":"\"Wyniki z Sekcji 2 (Środki i funkcje językowe i Wypowiedź pisemna): \"&'Informacje o klasie'!C4","v":"Wyniki z Sekcji 2 (Środki i funkcje językowe i Wypowiedź pisemna): "}]
[null,{"$f":"\"Data testu - Sekcja 2: \"&'Informacje o klasie'!C9","v":"Data testu - Sekcja 2: "}]
[null,{"$f":"\"Podręcznik: \"&'Informacje o klasie'!C6","v":"Podręcznik: "}]
[null,"Test w klasie VIII"]
[]
[null,null,null,null,"ZNAJOMOŚĆ ŚRODKÓW I FUNKCJI JĘZYKOWYCH",null,null,null,null,null,null,null,null,null,null,"WYPOWIEDŹ PISEMNA"]
[null,"Zadanie:",null,null,1,2,3,4,5,6,7,8,9,10,"SUMA","Temat","Treść ","Spójność \ni logika wypowiedzi ","Zakres środków językowych ","Poprawność środków językowych ","SUMA"]
[{"$f":"C10&\", \"&D10","v":"0, 0"},1,{"$f":"'Informacje o klasie'!C14","v":0},{"$f":"'Informacje o klasie'!D14","v":0},null,null,null,null,null,null,null,null,null,null,{"$f":"O125","v":0},null,null,null,null,null,{"$f":"SUM(P10:T10)","v":0}]
[{"$f":"C11&\", \"&D11","v":"0, 0"},2,{"$f":"'Informacje o klasie'!C15","v":0},{"$f":"'Informacje o klasie'!D15","v":0},null,null,null,null,null,null,null,null,null,null,{"$f":"O126","v":0},null,null,null,null,null,0]
["0, 0",3,{"$f":"'Informacje o klasie'!C16","v":0},{"$f":"'Informacje o klasie'!D16","v":0},null,null,null,null,null,null,null,null,null,null,0,null,null,null,null,null,0]
["0, 0",4,{"$f":"'Informacje o klasie'!C17","v":0},{"$f":"'Informacje o klasie'!D17","v":0},null,null,null,null,null,null,null,null,null,null,0,null,null,null,null,null,0]
["0, 0",5,{"$f":"'Informacje o klasie'!C18","v":0},{"$f":"'Informacje o klasie'!D18","v":0},null,null,null,null,null,null,null,null,null,null,0,null,null,null,null,null,0]
["0, 0",6,{"$f":"'Informacje o klasie'!C19","v":0},{"$f":"'Informacje o klasie'!D19","v":0},null,null,null,null,null,null,null,null,null,null,0,null,null,null,null,null,0]
["0, 0",7,{"$f":"'Informacje o klasie'!C20","v":0},{"$f":"'Informacje o klasie'!D20","v":0},null,null,null,null,null,null,null,null,null,null,0,null,null,null,null,null,0]
["0, 0",8,{"$f":"'Informacje o klasie'!C21","v":0},{"$f":"'Informacje o klasie'!D21","v":0},null,null,null,null,null,null,null,null,null,null,0,null,null,null,null,null,0]
["0, 0",9,{"$f":"'Informacje o klasie'!C22","v":0},{"$f":"'Informacje o klasie'!D22","v":0},null,null,null,null,null,null,null,null,null,null,0,null,null,null,null,null,0]
["0, 0",10,{"$f":"'Informacje o klasie'!C23","v":0},{"$f":"'Informacje o klasie'!D23","v":0},null,null,null,null,null,null,null,null,null,null,0,null,null,null,null,null,0]
["0, 0",11,{"$f":"'Informacje o klasie'!C24","v":0},{"$f":"'Informacje o klasie'!D24","v":0},null,null,null,null,null,null,null,null,null,null,0,null,null,null,null,null,0]
["0, 0",12,{"$f":"'Informacje o klasie'!C25","v":0},{"$f":"'Informacje o klasie'!D25","v":0},null,null,null,null,null,null,null,null,null,null,0,null,null,null,null,null,0]
["0, 0",13,{"$f":"'Informacje o klasie'!C26","v":0},{"$f":"'Informacje o klasie'!D26","v":0},null,null,null,null,null,null,null,null,null,null,0,null,null,null,null,null,0]
["0, 0",14,{"$f":"'Informacje o klasie'!C27","v":0},{"$f":"'Informacje o klasie'!D27","v":0},null,null,null,null,null,null,null,null,null,null,0,null,null,null,null,null,0]
["0, 0",15,{"$f":"'Informacje o klasie'!C28","v":0},{"$f":"'Informacje o klasie'!D28","v":0},null,null,null,null,null,null,null,null,null,null,0,null,null,null,null,null,0]
["0, 0",16,{"$f":"'Informacje o klasie'!C29","v":0},{"$f":"'Informacje o klasie'!D29","v":0},null,null,null,null,null,null,null,null,null,null,0,null,null,null,null,null,0]
["0, 0",17,{"$f":"'Informacje o klasie'!C30","v":0},{"$f":"'Informacje o klasie'!D30","v":0},null,null,null,null,null,null,null,null,null,null,0,null,null,null,null,null,0]
["0, 0",18,{"$f":"'Informacje o klasie'!C31","v":0},{"$f":"'Informacje o klasie'!D31","v":0},null,null,null,null,null,null,null,null,null,null,0,null,null,null,null,null,0]
["0, 0",19,{"$f":"'Informacje o klasie'!C32","v":0},{"$f":"'Informacje o klasie'!D32","v":0},null,null,null,null,null,null,null,null,null,null,0,null,null,null,null,null,0]
["0, 0",20,{"$f":"'Informacje o klasie'!C33","v":0},{"$f":"'Informacje o klasie'!D33","v":0},null,null,null,null,null,null,null,null,null,null,0,null,null,null,null,null,0]
["0, 0",21,{"$f":"'Informacje o klasie'!C34","v":0},{"$f":"'Informacje o klasie'!D34","v":0},null,null,null,null,null,null,null,null,null,null,0,null,null,null,null,null,0]
["0, 0",22,{"$f":"'Informacje o klasie'!C35","v":0},{"$f":"'Informacje o klasie'!D35","v":0},null,null,null,null,null,null,null,null,null,null,0,null,null,null,null,null,0]
["0, 0",23,{"$f":"'Informacje o klasie'!C36","v":0},{"$f":"'Informacje o klasie'!D36","v":0},null,null,null,null,null,null,null,null,null,null,0,null,null,null,null,null,0]
["0, 0",24,{"$f":"'Informacje o klasie'!C37","v":0},{"$f":"'Informacje o klasie'!D37","v":0},null,null,null,null,null,null,null,null,null,null,0,null,null,null,null,null,0]
["0, 0",25,{"$f":"'Informacje o klasie'!C38","v":0},{"$f":"'Informacje o klasie'!D38","v":0},null,null,null,null,null,null,null,null,null,null,0,null,null,null,null,null,0]
["0, 0",26,{"$f":"'Informacje o klasie'!C39","v":0},{"$f":"'Informacje o klasie'!D39","v":0},null,null,null,null,null,null,null,null,null,null,0,null,null,null,null,null,0]
["0, 0",27,{"$f":"'Informacje o klasie'!C40","v":0},{"$f":"'Informacje o klasie'!D40","v":0},null,null,null,null,null,null,null,null,null,null,0,null,null,null,null,null,0]
["0, 0",28,{"$f":"'Informacje o klasie'!C41","v":0},{"$f":"'Informacje o klasie'!D41","v":0},null,null,null,null,null,null,null,null,null,null,0,null,null,null,null,null,0]
["0, 0",29,{"$f":"'Informacje o klasie'!C42","v":0},{"$f":"'Informacje o klasie'!D42","v":0},null,null,null,null,null,null,null,null,null,null,0,null,null,null,null,null,0]
["0, 0",30,{"$f":"'Informacje o klasie'!C43","v":0},{"$f":"'Informacje o klasie'!D43","v":0},null,null,null,null,null,null,null,null,null,null,0,null,null,null,null,null,0]
["0, 0",31,{"$f":"'Informacje o klasie'!C44","v":0},{"$f":"'Informacje o klasie'!D44","v":0},null,null,null,null,null,null,null,null,null,null,0,null,null,null,null,null,0]
["0, 0",32,{"$f":"'Informacje o klasie'!C45","v":0},{"$f":"'Informacje o klasie'!D45","v":0},null,null,null,null,null,null,null,null,null,null,0,null,null,null,null,null,0]
["0, 0",33,{"$f":"'Informacje o klasie'!C46","v":0},{"$f":"'Informacje o klasie'!D46","v":0},null,null,null,null,null,null,null,null,null,null,0,null,null,null,null,null,{"$f":"SUM(P42:T42)","v":0}]
["0, 0",34,{"$f":"'Informacje o klasie'!C47","v":0},{"$f":"'Informacje o klasie'!D47","v":0},null,null,null,null,null,null,null,null,null,null,0,null,null,null,null,null,0]
["0, 0",35,{"$f":"'Informacje o klasie'!C48","v":0},{"$f":"'Informacje o klasie'!D48","v":0},null,null,null,null,null,null,null,null,null,null,0,null,null,null,null,null,0]
["0, 0",36,{"$f":"'Informacje o klasie'!C49","v":0},{"$f":"'Informacje o klasie'!D49","v":0},null,null,null,null,null,null,null,null,null,null,0,null,null,null,null,null,0]
["0, 0",37,{"$f":"'Informacje o klasie'!C50","v":0},{"$f":"'Informacje o klasie'!D50","v":0},null,null,null,null,null,null,null,null,null,null,0,null,null,null,null,null,0]
["0, 0",38,{"$f":"'Informacje o klasie'!C51","v":0},{"$f":"'Informacje o klasie'!D51","v":0},null,null,null,null,null,null,null,null,null,null,0,null,null,null,null,null,0]
["0, 0",39,{"$f":"'Informacje o klasie'!C52","v":0},{"$f":"'Informacje o klasie'!D52","v":0},null,null,null,null,null,null,null,null,null,null,0,null,null,null,null,null,0]
["0, 0",40,{"$f":"'Informacje o klasie'!C53","v":0},{"$f":"'Informacje o klasie'!D53","v":0},null,null,null,null,null,null,null,null,null,null,0,null,null,null,null,null,0]
["0, 0",41,{"$f":"'Informacje o klasie'!C54","v":0},{"$f":"'Informacje o klasie'!D54","v":0},null,null,null,null,null,null,null,null,null,null,0,null,null,null,null,null,0]
["0, 0",42,{"$f":"'Informacje o klasie'!C55","v":0},{"$f":"'Informacje o klasie'!D55","v":0},null,null,null,null,null,null,null,null,null,null,0,null,null,null,null,null,0]
["0, 0",43,{"$f":"'Informacje o klasie'!C56","v":0},{"$f":"'Informacje o klasie'!D56","v":0},null,null,null,null,null,null,null,null,null,null,0,null,null,null,null,null,0]
["0, 0",44,{"$f":"'Informacje o klasie'!C57","v":0},{"$f":"'Informacje o klasie'!D57","v":0},null,null,null,null,null,null,null,null,null,null,0,null,null,null,null,null,0]
["0, 0",45,{"$f":"'Informacje o klasie'!C58","v":0},{"$f":"'Informacje o klasie'!D58","v":0},null,null,null,null,null,null,null,null,null,null,0,null,null,null,null,null,0]
["0, 0",46,{"$f":"'Informacje o klasie'!C59","v":0},{"$f":"'Informacje o klasie'!D59","v":0},null,null,null,null,null,null,null,null,null,null,0,null,null,null,null,null,0]
["0, 0",47,{"$f":"'Informacje o klasie'!C60","v":0},{"$f":"'Informacje o klasie'!D60","v":0},null,null,null,null,null,null,null,null,null,null,0,null,null,null,null,null,0]
["0, 0",48,{"$f":"'Informacje o klasie'!C61","v":0},{"$f":"'Informacje o klasie'!D61","v":0},null,null,null,null,null,null,null,null,null,null,0,null,null,null,null,null,0]
["0, 0",49,{"$f":"'Informacje o klasie'!C62","v":0},{"$f":"'Informacje o klasie'!D62","v":0},null,null,null,null,null,null,null,null,null,null,0,null,null,null,null,null,0]
["0, 0",50,{"$f":"'Informacje o klasie'!C63","v":0},{"$f":"'Informacje o klasie'!D63","v":0},null,null,null,null,null,null,null,null,null,null,0,null,null,null,null,null,0]
["0, 0",51,{"$f":"'Informacje o klasie'!C64","v":0},{"$f":"'Informacje o klasie'!D64","v":0},null,null,null,null,null,null,null,null,null,null,0,null,null,null,null,null,0]
["0, 0",52,{"$f":"'Informacje o klasie'!C65","v":0},{"$f":"'Informacje o klasie'!D65","v":0},null,null,null,null,null,null,null,null,null,null,0,null,null,null,null,null,0]
["0, 0",53,{"$f":"'Informacje o klasie'!C66","v":0},{"$f":"'Informacje o klasie'!D66","v":0},null,null,null,null,null,null,null,null,null,null,0,null,null,null,null,null,0]
["0, 0",54,{"$f":"'Informacje o klasie'!C67","v":0},{"$f":"'Informacje o klasie'!D67","v":0},null,null,null,null,null,null,null,null,null,null,0,null,null,null,null,null,0]
["0, 0",55,{"$f":"'Informacje o klasie'!C68","v":0},{"$f":"'Informacje o klasie'!D68","v":0},null,null,null,null,null,null,null,null,null,null,0,null,null,null,null,null,0]
["0, 0",56,{"$f":"'Informacje o klasie'!C69","v":0},{"$f":"'Informacje o klasie'!D69","v":0},null,null,null,null,null,null,null,null,null,null,0,null,null,null,null,null,0]
["0, 0",57,{"$f":"'Informacje o klasie'!C70","v":0},{"$f":"'Informacje o klasie'!D70","v":0},null,null,null,null,null,null,null,null,null,null,0,null,null,null,null,null,0]
["0, 0",58,{"$f":"'Informacje o klasie'!C71","v":0},{"$f":"'Informacje o klasie'!D71","v":0},null,null,null,null,null,null,null,null,null,null,0,null,null,null,null,null,0]
["0, 0",59,{"$f":"'Informacje o klasie'!C72","v":0},{"$f":"'Informacje o klasie'!D72","v":0},null,null,null,null,null,null,null,null,null,null,0,null,null,null,null,null,0]
["0, 0",60,{"$f":"'Informacje o klasie'!C73","v":0},{"$f":"'Informacje o klasie'!D73","v":0},null,null,null,null,null,null,null,null,null,null,0,null,null,null,null,null,0]
["0, 0",61,{"$f":"'Informacje o klasie'!C74","v":0},{"$f":"'Informacje o klasie'!D74","v":0},null,null,null,null,null,null,null,null,null,null,0,null,null,null,null,null,0]
["0, 0",62,{"$f":"'Informacje o klasie'!C75","v":0},{"$f":"'Informacje o klasie'!D75","v":0},null,null,null,null,null,null,null,null,null,null,0,null,null,null,null,null,0]
["0, 0",63,{"$f":"'Informacje o klasie'!C76","v":0},{"$f":"'Informacje o klasie'!D76","v":0},null,null,null,null,null,null,null,null,null,null,0,null,null,null,null,null,0]
["0, 0",64,{"$f":"'Informacje o klasie'!C77","v":0},{"$f":"'Informacje o klasie'!D77","v":0},null,null,null,null,null,null,null,null,null,null,0,null,null,null,null,null,0]
["0, 0",65,{"$f":"'Informacje o klasie'!C78","v":0},{"$f":"'Informacje o klasie'!D78","v":0},null,null,null,null,null,null,null,null,null,null,0,null,null,null,null,null,{"$f":"SUM(P74:T74)","v":0}]
[{"$f":"C75&\", \"&D75","v":"0, 0"},66,{"$f":"'Informacje o klasie'!C79","v":0},{"$f":"'Informacje o klasie'!D79","v":0},null,null,null,null,null,null,null,null,null,null,{"$f":"O190","v":0},null,null,null,null,null,{"$f":"SUM(P75:T75)","v":0}]
["0, 0",67,{"$f":"'Informacje o klasie'!C80","v":0},{"$f":"'Informacje o klasie'!D80","v":0},null,null,null,null,null,null,null,null,null,null,0,null,null,null,null,null,0]
["0, 0",68,{"$f":"'Informacje o klasie'!C81","v":0},{"$f":"'Informacje o klasie'!D81","v":0},null,null,null,null,null,null,null,null,null,null,0,null,null,null,null,null,0]
["0, 0",69,{"$f":"'Informacje o klasie'!C82","v":0},{"$f":"'Informacje o klasie'!D82","v":0},null,null,null,null,null,null,null,null,null,null,0,null,null,null,null,null,0]
["0, 0",70,{"$f":"'Informacje o klasie'!C83","v":0},{"$f":"'Informacje o klasie'!D83","v":0},null,null,null,null,null,null,null,null,null,null,0,null,null,null,null,null,0]
["0, 0",71,{"$f":"'Informacje o klasie'!C84","v":0},{"$f":"'Informacje o klasie'!D84","v":0},null,null,null,null,null,null,null,null,null,null,0,null,null,null,null,null,0]
["0, 0",72,{"$f":"'Informacje o klasie'!C85","v":0},{"$f":"'Informacje o klasie'!D85","v":0},null,null,null,null,null,null,null,null,null,null,0,null,null,null,null,null,0]
["0, 0",73,{"$f":"'Informacje o klasie'!C86","v":0},{"$f":"'Informacje o klasie'!D86","v":0},null,null,null,null,null,null,null,null,null,null,0,null,null,null,null,null,0]
["0, 0",74,{"$f":"'Informacje o klasie'!C87","v":0},{"$f":"'Informacje o klasie'!D87","v":0},null,null,null,null,null,null,null,null,null,null,0,null,null,null,null,null,0]
["0, 0",75,{"$f":"'Informacje o klasie'!C88","v":0},{"$f":"'Informacje o klasie'!D88","v":0},null,null,null,null,null,null,null,null,null,null,0,null,null,null,null,null,0]
["0, 0",76,{"$f":"'Informacje o klasie'!C89","v":0},{"$f":"'Informacje o klasie'!D89","v":0},null,null,null,null,null,null,null,null,null,null,0,null,null,null,null,null,0]
["0, 0",77,{"$f":"'Informacje o klasie'!C90","v":0},{"$f":"'Informacje o klasie'!D90","v":0},null,null,null,null,null,null,null,null,null,null,0,null,null,null,null,null,0]
["0, 0",78,{"$f":"'Informacje o klasie'!C91","v":0},{"$f":"'Informacje o klasie'!D91","v":0},null,null,null,null,null,null,null,null,null,null,0,null,null,null,null,null,0]
["0, 0",79,{"$f":"'Informacje o klasie'!C92","v":0},{"$f":"'Informacje o klasie'!D92","v":0},null,null,null,null,null,null,null,null,null,null,0,null,null,null,null,null,0]
["0, 0",80,{"$f":"'Informacje o klasie'!C93","v":0},{"$f":"'Informacje o klasie'!D93","v":0},null,null,null,null,null,null,null,null,null,null,0,null,null,null,null,null,0]
["0, 0",81,{"$f":"'Informacje o klasie'!C94","v":0},{"$f":"'Informacje o klasie'!D94","v":0},null,null,null,null,null,null,null,null,null,null,0,null,null,null,null,null,0]
["0, 0",82,{"$f":"'Informacje o klasie'!C95","v":0},{"$f":"'Informacje o klasie'!D95","v":0},null,null,null,null,null,null,null,null,null,null,0,null,null,null,null,null,0]
["0, 0",83,{"$f":"'Informacje o klasie'!C96","v":0},{"$f":"'Informacje o klasie'!D96","v":0},null,null,null,null,null,null,null,null,null,null,0,null,null,null,null,null,0]
["0, 0",84,{"$f":"'Informacje o klasie'!C97","v":0},{"$f":"'Informacje o klasie'!D97","v":0},null,null,null,null,null,null,null,null,null,null,0,null,null,null,null,null,0]
["0, 0",85,{"$f":"'Informacje o klasie'!C98","v":0},{"$f":"'Informacje o klasie'!D98","v":0},null,null,null,null,null,null,null,null,null,null,0,null,null,null,null,null,0]
["0, 0",86,{"$f":"'Informacje o klasie'!C99","v":0},{"$f":"'Informacje o klasie'!D99","v":0},null,null,null,null,null,null,null,null,null,null,0,null,null,null,null,null,0]
["0, 0",87,{"$f":"'Informacje o klasie'!C100","v":0},{"$f":"'Informacje o klasie'!D100","v":0},null,null,null,null,null,null,null,null,null,null,0,null,null,null,null,null,0]
["0, 0",88,{"$f":"'Informacje o klasie'!C101","v":0},{"$f":"'Informacje o klasie'!D101","v":0},null,null,null,null,null,null,null,null,null,null,0,null,null,null,null,null,0]
["0, 0",89,{"$f":"'Informacje o klasie'!C102","v":0},{"$f":"'Informacje o klasie'!D102","v":0},null,null,null,null,null,null,null,null,null,null,0,null,null,null,null,null,0]
["0, 0",90,{"$f":"'Informacje o klasie'!C103","v":0},{"$f":"'Informacje o klasie'!D103","v":0},null,null,null,null,null,null,null,null,null,null,0,null,null,null,null,null,0]
["0, 0",91,{"$f":"'Informacje o klasie'!C104","v":0},{"$f":"'Informacje o klasie'!D104","v":0},null,null,null,null,null,null,null,null,null,null,0,null,null,null,null,null,0]
["0, 0",92,{"$f":"'Informacje o klasie'!C105","v":0},{"$f":"'Informacje o klasie'!D105","v":0},null,null,null,null,null,null,null,null,null,null,0,null,null,null,null,null,0]
["0, 0",93,{"$f":"'Informacje o klasie'!C106","v":0},{"$f":"'Informacje o klasie'!D106","v":0},null,null,null,null,null,null,null,null,null,null,0,null,null,null,null,null,0]
["0, 0",94,{"$f":"'Informacje o klasie'!C107","v":0},{"$f":"'Informacje o klasie'!D107","v":0},null,null,null,null,null,null,null,null,null,null,0,null,null,null,null,null,0]
["0, 0",95,{"$f":"'Informacje o klasie'!C108","v":0},{"$f":"'Informacje o klasie'!D108","v":0},null,null,null,null,null,null,null,null,null,null,0,null,null,null,null,null,0]
["0, 0",96,{"$f":"'Informacje o klasie'!C109","v":0},{"$f":"'Informacje o klasie'!D109","v":0},null,null,null,null,null,null,null,null,null,null,0,null,null,null,null,null,0]
["0, 0",97,{"$f":"'Informacje o klasie'!C110","v":0},{"$f":"'Informacje o klasie'!D110","v":0},null,null,null,null,null,null,null,null,null,null,0,null,null,null,null,null,0]
["0, 0",98,{"$f":"'Informacje o klasie'!C111","v":0},{"$f":"'Informacje o klasie'!D111","v":0},null,null,null,null,null,null,null,null,null,null,0,null,null,null,null,null,0]
["0, 0",99,{"$f":"'Informacje o klasie'!C112","v":0},{"$f":"'Informacje o klasie'!D112","v":0},null,null,null,null,null,null,null,null,null,null,0,null,null,null,null,null,0]
[]
[]
[]
[null,null,null,null,"Calculation of results for chosen level"]
[null,null,null,null,{"$f":"E8","v":"ZNAJOMOŚĆ ŚRODKÓW I FUNKCJI JĘZYKOWYCH"}]
[null,null,null,null,1,2,3,4,5,6,7,8,9,10,"TOTAL"]
[null,null,null,"Current level",{"$f":"IF('Informacje o klasie'!$C$5='Wyniki z Sekcji 1'!$D$116,E116,\nIF('Informacje o klasie'!$C$5='Wyniki z Sekcji 1'!$D$117,E117,\nIF('Informacje o klasie'!$C$5='Wyniki z Sekcji 1'!$D$118,E118,\nIF('Informacje o klasie'!$C$5='Wyniki z Sekcji 1'!$D$119,E119,\nIF('Informacje o klasie'!$C$5='Wyniki z Sekcji 1'!$D$120,E120,\n\"No level selected\")))))","v":"A"},{"$f":"IF('Informacje o klasie'!$C$5='Wyniki z Sekcji 1'!$D$116,F116,\nIF('Informacje o klasie'!$C$5='Wyniki z Sekcji 1'!$D$117,F117,\nIF('Informacje o klasie'!$C$5='Wyniki z Sekcji 1'!$D$118,F118,\nIF('Informacje o klasie'!$C$5='Wyniki z Sekcji 1'!$D$119,F119,\nIF('Informacje o klasie'!$C$5='Wyniki z Sekcji 1'!$D$120,F120,\n\"No level selected\")))))","v":"C"},{"$f":"IF('Informacje o klasie'!$C$5='Wyniki z Sekcji 1'!$D$116,G116,\nIF('Informacje o klasie'!$C$5='Wyniki z Sekcji 1'!$D$117,G117,\nIF('Informacje o klasie'!$C$5='Wyniki z Sekcji 1'!$D$118,G118,\nIF('Informacje o klasie'!$C$5='Wyniki z Sekcji 1'!$D$119,G119,\nIF('Informacje o klasie'!$C$5='Wyniki z Sekcji 1'!$D$120,G120,\n\"No level selected\")))))","v":"B"},{"$f":"IF('Informacje o klasie'!$C$5='Wyniki z Sekcji 1'!$D$116,H116,\nIF('Informacje o klasie'!$C$5='Wyniki z Sekcji 1'!$D$117,H117,\nIF('Informacje o klasie'!$C$5='Wyniki z Sekcji 1'!$D$118,H118,\nIF('Informacje o klasie'!$C$5='Wyniki z Sekcji 1'!$D$119,H119,\nIF('Informacje o klasie'!$C$5='Wyniki z Sekcji 1'!$D$120,H120,\n\"No level selected\")))))","v":"C"},{"$f":"IF('Informacje o klasie'!$C$5='Wyniki z Sekcji 1'!$D$116,I116,\nIF('Informacje o klasie'!$C$5='Wyniki z Sekcji 1'!$D$117,I117,\nIF('Informacje o klasie'!$C$5='Wyniki z Sekcji 1'!$D$118,I118,\nIF('Informacje o klasie'!$C$5='Wyniki z Sekcji 1'!$D$119,I119,\nIF('Informacje o klasie'!$C$5='Wyniki z Sekcji 1'!$D$120,I120,\n\"No level selected\")))))","v":"A"},{"$f":"IF('Informacje o klasie'!$C$5='Wyniki z Sekcji 1'!$D$116,J116,\nIF('Informacje o klasie'!$C$5='Wyniki z Sekcji 1'!$D$117,J117,\nIF('Informacje o klasie'!$C$5='Wyniki z Sekcji 1'!$D$118,J118,\nIF('Informacje o klasie'!$C$5='Wyniki z Sekcji 1'!$D$119,J119,\nIF('Informacje o klasie'!$C$5='Wyniki z Sekcji 1'!$D$120,J120,\n\"No level selected\")))))","v":"B"},{"$f":"IF('Informacje o klasie'!$C$5='Wyniki z Sekcji 1'!$D$116,K116,\nIF('Informacje o klasie'!$C$5='Wyniki z Sekcji 1'!$D$117,K117,\nIF('Informacje o klasie'!$C$5='Wyniki z Sekcji 1'!$D$118,K118,\nIF('Informacje o klasie'!$C$5='Wyniki z Sekcji 1'!$D$119,K119,\nIF('Informacje o klasie'!$C$5='Wyniki z Sekcji 1'!$D$120,K120,\n\"No level selected\")))))","v":"B"},{"$f":"IF('Informacje o klasie'!$C$5='Wyniki z Sekcji 1'!$D$116,L116,\nIF('Informacje o klasie'!$C$5='Wyniki z Sekcji 1'!$D$117,L117,\nIF('Informacje o klasie'!$C$5='Wyniki z Sekcji 1'!$D$118,L118,\nIF('Informacje o klasie'!$C$5='Wyniki z Sekcji 1'!$D$119,L119,\nIF('Informacje o klasie'!$C$5='Wyniki z Sekcji 1'!$D$120,L120,\n\"No level selected\")))))","v":"A"},{"$f":"IF('Informacje o klasie'!$C$5='Wyniki z Sekcji 1'!$D$116,M116,\nIF('Informacje o klasie'!$C$5='Wyniki z Sekcji 1'!$D$117,M117,\nIF('Informacje o klasie'!$C$5='Wyniki z Sekcji 1'!$D$118,M118,\nIF('Informacje o klasie'!$C$5='Wyniki z Sekcji 1'!$D$119,M119,\nIF('Informacje o klasie'!$C$5='Wyniki z Sekcji 1'!$D$120,M120,\n\"No level selected\")))))","v":"C"},{"$f":"IF('Informacje o klasie'!$C$5='Wyniki z Sekcji 1'!$D$116,N116,\nIF('Informacje o klasie'!$C$5='Wyniki z Sekcji 1'!$D$117,N117,\nIF('Informacje o klasie'!$C$5='Wyniki z Sekcji 1'!$D$118,N118,\nIF('Informacje o klasie'!$C$5='Wyniki z Sekcji 1'!$D$119,N119,\nIF('Informacje o klasie'!$C$5='Wyniki z Sekcji 1'!$D$120,N120,\n\"No level selected\")))))","v":"A"}]
[null,null,null,"Test diagnostyczny 5","A","C","B","C","A","B","B","A","C","A"]
[null,null,null,{"$f":"Validation!J3","v":0},"A","C","C","B","B","B","A","A","B","C"]
[null,null,null,{"$f":"Validation!J4","v":0},"B","A","B","C","B","C","A","B","C","C"]
[null,null,null,{"$f":"Validation!J5","v":0},"C","B","C","B","C","B","C","A","C","C"]
[null,null,null,{"$f":"Validation!J6","v":0},"B","C","C","A","B","G","A","D","F","E"]
[null,null,null,"Choice range",{"$f":"IF('Informacje o klasie'!$C$5='Wyniki z Sekcji 2'!$D$116,\"AC\",\nIF('Informacje o klasie'!$C$5='Wyniki z Sekcji 2'!$D$117,\"AC\",\nIF('Informacje o klasie'!$C$5='Wyniki z Sekcji 2'!$D$118,\"AC\",\nIF('Informacje o klasie'!$C$5='Wyniki z Sekcji 2'!$D$119,\"AC\",\nIF('Informacje o klasie'!$C$5='Wyniki z Sekcji 2'!$D$120,\"AC\",\n\"No level selected\")))))","v":"AC"},{"$f":"IF('Informacje o klasie'!$C$5='Wyniki z Sekcji 2'!$D$116,\"AC\",\nIF('Informacje o klasie'!$C$5='Wyniki z Sekcji 2'!$D$117,\"AC\",\nIF('Informacje o klasie'!$C$5='Wyniki z Sekcji 2'!$D$118,\"AC\",\nIF('Informacje o klasie'!$C$5='Wyniki z Sekcji 2'!$D$119,\"AC\",\nIF('Informacje o klasie'!$C$5='Wyniki z Sekcji 2'!$D$120,\"AC\",\n\"No level selected\")))))","v":"AC"},{"$f":"IF('Informacje o klasie'!$C$5='Wyniki z Sekcji 2'!$D$116,\"AC\",\nIF('Informacje o klasie'!$C$5='Wyniki z Sekcji 2'!$D$117,\"AC\",\nIF('Informacje o klasie'!$C$5='Wyniki z Sekcji 2'!$D$118,\"AC\",\nIF('Informacje o klasie'!$C$5='Wyniki z Sekcji 2'!$D$119,\"AC\",\nIF('Informacje o klasie'!$C$5='Wyniki z Sekcji 2'!$D$120,\"AC\",\n\"No level selected\")))))","v":"AC"},{"$f":"IF('Informacje o klasie'!$C$5='Wyniki z Sekcji 2'!$D$116,\"AC\",\nIF('Informacje o klasie'!$C$5='Wyniki z Sekcji 2'!$D$117,\"AC\",\nIF('Informacje o klasie'!$C$5='Wyniki z Sekcji 2'!$D$118,\"AC\",\nIF('Informacje o klasie'!$C$5='Wyniki z Sekcji 2'!$D$119,\"AC\",\nIF('Informacje o klasie'!$C$5='Wyniki z Sekcji 2'!$D$120,\"AC\",\n\"No level selected\")))))","v":"AC"},{"$f":"IF('Informacje o klasie'!$C$5='Wyniki z Sekcji 2'!$D$116,\"AC\",\nIF('Informacje o klasie'!$C$5='Wyniki z Sekcji 2'!$D$117,\"AC\",\nIF('Informacje o klasie'!$C$5='Wyniki z Sekcji 2'!$D$118,\"AC\",\nIF('Informacje o klasie'!$C$5='Wyniki z Sekcji 2'!$D$119,\"AC\",\nIF('Informacje o klasie'!$C$5='Wyniki z Sekcji 2'!$D$120,\"AC\",\n\"No level selected\")))))","v":"AC"},{"$f":"IF('Informacje o klasie'!$C$5='Wyniki z Sekcji 2'!$D$116,\"AC\",\nIF('Informacje o klasie'!$C$5='Wyniki z Sekcji 2'!$D$117,\"AC\",\nIF('Informacje o klasie'!$C$5='Wyniki z Sekcji 2'!$D$118,\"AC\",\nIF('Informacje o klasie'!$C$5='Wyniki z Sekcji 2'!$D$119,\"AC\",\nIF('Informacje o klasie'!$C$5='Wyniki z Sekcji 2'!$D$120,\"AH\",\n\"No level selected\")))))","v":"AC"},{"$f":"IF('Informacje o klasie'!$C$5='Wyniki z Sekcji 2'!$D$116,\"AC\",\nIF('Informacje o klasie'!$C$5='Wyniki z Sekcji 2'!$D$117,\"AC\",\nIF('Informacje o klasie'!$C$5='Wyniki z Sekcji 2'!$D$118,\"AC\",\nIF('Informacje o klasie'!$C$5='Wyniki z Sekcji 2'!$D$119,\"AC\",\nIF('Informacje o klasie'!$C$5='Wyniki z Sekcji 2'!$D$120,\"AH\",\n\"No level selected\")))))","v":"AC"},{"$f":"IF('Informacje o klasie'!$C$5='Wyniki z Sekcji 2'!$D$116,\"AC\",\nIF('Informacje o klasie'!$C$5='Wyniki z Sekcji 2'!$D$117,\"AC\",\nIF('Informacje o klasie'!$C$5='Wyniki z Sekcji 2'!$D$118,\"AC\",\nIF('Informacje o klasie'!$C$5='Wyniki z Sekcji 2'!$D$119,\"AC\",\nIF('Informacje o klasie'!$C$5='Wyniki z Sekcji 2'!$D$120,\"AH\",\n\"No level selected\")))))","v":"AC"},{"$f":"IF('Informacje o klasie'!$C$5='Wyniki z Sekcji 2'!$D$116,\"AC\",\nIF('Informacje o klasie'!$C$5='Wyniki z Sekcji 2'!$D$117,\"AC\",\nIF('Informacje o klasie'!$C$5='Wyniki z Sekcji 2'!$D$118,\"AC\",\nIF('Informacje o klasie'!$C$5='Wyniki z Sekcji 2'!$D$119,\"AC\",\nIF('Informacje o klasie'!$C$5='Wyniki z Sekcji 2'!$D$120,\"AH\",\n\"No level selected\")))))","v":"AC"},{"$f":"IF('Informacje o klasie'!$C$5='Wyniki z Sekcji 2'!$D$116,\"AC\",\nIF('Informacje o klasie'!$C$5='Wyniki z Sekcji 2'!$D$117,\"AC\",\nIF('Informacje o klasie'!$C$5='Wyniki z Sekcji 2'!$D$118,\"AC\",\nIF('Informacje o klasie'!$C$5='Wyniki z Sekcji 2'!$D$119,\"AC\",\nIF('Informacje o klasie'!$C$5='Wyniki z Sekcji 2'!$D$120,\"AH\",\n\"No level selected\")))))","v":"AC"}]
[null,null,null,null,"Calculation of total score by student"]
[null,null,null,null,{"$f":"E113","v":"ZNAJOMOŚĆ ŚRODKÓW I FUNKCJI JĘZYKOWYCH"}]
[null,"Question:",null,null,1,2,3,4,5,6,7,8,9,10,"TOTAL"]
[null,1,{"$f":"C10","v":0},{"$f":"D10","v":0},{"$f":"IF(E10=E$115,1,0)","v":0},{"$f":"IF(F10=F$115,1,0)","v":0},0,0,0,0,0,0,0,0,{"$f":"SUM(E125:N125)","v":0}]
[null,2,{"$f":"C11","v":0},0,{"$f":"IF(E11=E$115,1,0)","v":0},0,0,0,0,0,0,0,0,0,{"$f":"SUM(E126:N126)","v":0}]
[null,3,0,0,0,0,0,0,0,0,0,0,0,0,0]
[null,4,0,0,0,0,0,0,0,0,0,0,0,0,0]
[null,5,0,0,0,0,0,0,0,0,0,0,0,0,0]
[null,6,0,0,0,0,0,0,0,0,0,0,0,0,0]
[null,7,0,0,0,0,0,0,0,0,0,0,0,0,0]
[null,8,0,0,0,0,0,0,0,0,0,0,0,0,0]
[null,9,0,0,0,0,0,0,0,0,0,0,0,0,0]
[null,10,0,0,0,0,0,0,0,0,0,0,0,0,0]
[null,11,0,0,0,0,0,0,0,0,0,0,0,0,0]
[null,12,0,0,0,0,0,0,0,0,0,0,0,0,0]
[null,13,0,0,0,0,0,0,0,0,0,0,0,0,0]
[null,14,0,0,0,0,0,0,0,0,0,0,0,0,0]
[null,15,0,0,0,0,0,0,0,0,0,0,0,0,0]
[null,16,0,0,0,0,0,0,0,0,0,0,0,0,0]
[null,17,0,0,0,0,0,0,0,0,0,0,0,0,0]
[null,18,{"$f":"C27","v":0},0,{"$f":"IF(E27=E$115,1,0)","v":0},0,0,0,0,0,0,0,0,0,0]
[null,19,0,0,0,0,0,0,0,0,0,0,0,0,0]
[null,20,0,0,0,0,0,0,0,0,0,0,0,0,0]
[null,21,0,0,0,0,0,0,0,0,0,0,0,0,0]
[null,22,0,0,0,0,0,0,0,0,0,0,0,0,0]
[null,23,0,0,0,0,0,0,0,0,0,0,0,0,0]
[null,24,0,0,0,0,0,0,0,0,0,0,0,0,0]
[null,25,0,0,0,0,0,0,0,0,0,0,0,0,0]
[null,26,0,0,0,0,0,0,0,0,0,0,0,0,0]
[null,27,0,0,0,0,0,0,0,0,0,0,0,0,0]
[null,28,0,0,0,0,0,0,0,0,0,0,0,0,0]
[null,29,0,0,0,0,0,0,0,0,0,0,0,0,0]
[null,30,0,0,0,0,0,0,0,0,0,0,0,0,0]
[null,31,0,0,0,0,0,0,0,0,0,0,0,0,0]
[null,32,0,0,0,0,0,0,0,0,0,0,0,0,0]
[null,33,0,0,0,0,0,0,0,0,0,0,0,0,0]
[null,34,{"$f":"C43","v":0},0,{"$f":"IF(E43=E$115,1,0)","v":0},0,0,0,0,0,0,0,0,0,0]
[null,35,0,0,0,0,0,0,0,0,0,0,0,0,0]
[null,36,0,0,0,0,0,0,0,0,0,0,0,0,0]
[null,37,0,0,0,0,0,0,0,0,0,0,0,0,0]
[null,38,0,0,0,0,0,0,0,0,0,0,0,0,0]
[null,39,0,0,0,0,0,0,0,0,0,0,0,0,0]
[null,40,0,0,0,0,0,0,0,0,0,0,0,0,0]
[null,41,0,0,0,0,0,0,0,0,0,0,0,0,0]
[null,42,0,0,0,0,0,0,0,0,0,0,0,0,0]
[null,43,0,0,0,0,0,0,0,0,0,0,0,0,0]
[null,44,0,0,0,0,0,0,0,0,0,0,0,0,0]
[null,45,0,0,0,0,0,0,0,0,0,0,0,0,0]
[null,46,0,0,0,0,0,0,0,0,0,0,0,0,0]
[null,47,0,0,0,0,0,0,0,0,0,0,0,0,0]
[null,48,0,0,0,0,0,0,0,0,0,0,0,0,0]
[null,49,0,0,0,0,0,0,0,0,0,0,0,0,0]
[null,50,{"$f":"C59","v":0},0,{"$f":"IF(E59=E$115,1,0)","v":0},0,0,0,0,0,0,0,0,0,0]
[null,51,0,0,0,0,0,0,0,0,0,0,0,0,0]
[null,52,0,0,0,0,0,0,0,0,0,0,0,0,0]
[null,53,0,0,0,0,0,0,0,0,0,0,0,0,0]
[null,54,0,0,0,0,0,0,0,0,0,0,0,0,0]
[null,55,0,0,0,0,0,0,0,0,0,0,0,0,0]
[null,56,0,0,0,0,0,0,0,0,0,0,0,0,0]
[null,57,0,0,0,0,0,0,0,0,0,0,0,0,0]
[null,58,0,0,0,0,0,0,0,0,0,0,0,0,0]
[null,59,0,0,0,0,0,0,0,0,0,0,0,0,0]
[null,60,0,0,0,0,0,0,0,0,0,0,0,0,0]
[null,61,0,0,0,0,0,0,0,0,0,0,0,0,0]
[null,62,0,0,0,0,0,0,0,0,0,0,0,0,0]
[null,63,0,0,0,0,0,0,0,0,0,0,0,0,0]
[null,64,0,0,0,0,0,0,0,0,0,0,0,0,0]
[null,65,0,0,0,0,0,0,0,0,0,0,0,0,0]
[null,66,{"$f":"C75","v":0},0,{"$f":"IF(E75=E$115,1,0)","v":0},0,0,0,0,0,0,0,0,0,{"$f":"SUM(E190:N190)","v":0}]
[null,67,0,0,0,0,0,0,0,0,0,0,0,0,0]
[null,68,0,0,0,0,0,0,0,0,0,0,0,0,0]
[null,69,0,0,0,0,0,0,0,0,0,0,0,0,0]
[null,70,0,0,0,0,0,0,0,0,0,0,0,0,0]
[null,71,0,0,0,0,0,0,0,0,0,0,0,0,0]
[null,72,0,0,0,0,0,0,0,0,0,0,0,0,0]
[null,73,0,0,0,0,0,0,0,0,0,0,0,0,0]
[null,74,0,0,0,0,0,0,0,0,0,0,0,0,0]
[null,75,0,0,0,0,0,0,0,0,0,0,0,0,0]
[null,76,0,0,0,0,0,0,0,0,0,0,0,0,0]
[null,77,0,0,0,0,0,0,0,0,0,0,0,0,0]
[null,78,0,0,0,0,0,0,0,0,0,0,0,0,0]
[null,79,0,0,0,0,0,0,0,0,0,0,0,0,0]
[null,80,0,0,0,0,0,0,0,0,0,0,0,0,0]
[null,81,0,0,0,0,0,0,0,0,0,0,0,0,0]
[null,82,{"$f":"C91","v":0},0,{"$f":"IF(E91=E$115,1,0)","v":0},0,0,0,0,0,0,0,0,0,0]
[null,83,0,0,0,0,0,0,0,0,0,0,0,0,0]
[null,84,0,0,0,0,0,0,0,0,0,0,0,0,0]
[null,85,0,0,0,0,0,0,0,0,0,0,0,0,0]
[null,86,0,0,0,0,0,0,0,0,0,0,0,0,0]
[null,87,0,0,0,0,0,0,0,0,0,0,0,0,0]
[null,88,0,0,0,0,0,0,0,0,0,0,0,0,0]
[null,89,0,0,0,0,0,0,0,0,0,0,0,0,0]
[null,90,0,0,0,0,0,0,0,0,0,0,0,0,0]
[null,91,0,0,0,0,0,0,0,0,0,0,0,0,0]
[null,92,0,0,0,0,0,0,0,0,0,0,0,0,0]
[null,93,0,0,0,0,0,0,0,0,0,0,0,0,0]
[null,94,0,0,0,0,0,0,0,0,0,0,0,0,0]
[null,95,0,0,0,0,0,0,0,0,0,0,0,0,0]
[null,96,0,0,0,0,0,0,0,0,0,0,0,0,0]
[null,97,0,0,0,0,0,0,0,0,0,0,0,0,0]
[null,98,{"$f":"C107","v":0},0,{"$f":"IF(E107=E$115,1,0)","v":0},0,0,0,0,0,0,0,0,0,0]
[null,99,0,0,0,0,0,0,0,0,0,0,0,0,0]
[null,null,null,null,{"$f":"SUM(E125:E223)","v":0},{"$f":"SUM(F125:F223)","v":0},0,0,0,0,0,0,0,0,{"$f":"SUM(O125:O223)","v":0},null,{"$f":"SUM(Q10:Q108)","v":0},{"$f":"SUM(R10:R108)","v":0},{"$f":"SUM(S10:S108)","v":0},{"$f":"SUM(T10:T108)","v":0},{"$f":"SUM(U10:U108)","v":0}]
[null,null,null,null,{"$f":"(E224/'Informacje o klasie'!$C$11)","v":{"$error":"#DIV/0!"}},{"$f":"(F224/'Informacje o klasie'!$C$11)","v":{"$error":"#DIV/0!"}},{"$f":"(G224/'Informacje o klasie'!$C$11)","v":{"$error":"#DIV/0!"}},{"$f":"(H224/'Informacje o klasie'!$C$11)","v":{"$error":"#DIV/0!"}},{"$f":"(I224/'Informacje o klasie'!$C$11)","v":{"$error":"#DIV/0!"}},{"$f":"(J224/'Informacje o klasie'!$C$11)","v":{"$error":"#DIV/0!"}},{"$f":"(K224/'Informacje o klasie'!$C$11)","v":{"$error":"#DIV/0!"}},{"$f":"(L224/'Informacje o klasie'!$C$11)","v":{"$error":"#DIV/0!"}},{"$f":"(M224/'Informacje o klasie'!$C$11)","v":{"$error":"#DIV/0!"}},{"$f":"(N224/'Informacje o klasie'!$C$11)","v":{"$error":"#DIV/0!"}},null,null,{"$f":"((Q224/'Informacje o klasie'!$C$11)/4)","v":{"$error":"#DIV/0!"}},{"$f":"((R224/'Informacje o klasie'!$C$11)/4)","v":{"$error":"#DIV/0!"}},{"$f":"((S224/'Informacje o klasie'!$C$11)/3)","v":{"$error":"#DIV/0!"}},{"$f":"((T224/'Informacje o klasie'!$C$11)/3)","v":{"$error":"#DIV/0!"}}]
[null,null,null,null,null,null,null,null,null,null,null,"Class average",null,null,{"$f":"ROUND(O224/'Informacje o klasie'!$C$11,0)","v":{"$error":"#DIV/0!"}},null,null,null,null,null,{"$f":"ROUND(U224/'Informacje o klasie'!$C$11,0)","v":{"$error":"#DIV/0!"}}]

{"sheet":"Wyniki z Sekcji 3","index":5,"n_rows":226,"n_cols":9,"rows_kept":226,"cut":false,"hidden":false,"merged":[[7,4,7,8],[112,6,112,8],[122,6,122,8],[122,1,122,3],[123,1,123,3],[7,1,7,3],[8,1,8,3]]}
[]
[null,"Test diagnostyczny 5"]
[null,{"$f":"\"Wynki z Sekcji 3 (Wypowiedź ustna): \"&'Informacje o klasie'!C4","v":"Wynki z Sekcji 3 (Wypowiedź ustna): "}]
[null,{"$f":"\"Data testu - Sekcja 3: \"&'Informacje o klasie'!C10","v":"Data testu - Sekcja 3: "}]
[null,{"$f":"\"Podręcznik: \"&'Informacje o klasie'!C6","v":"Podręcznik: "}]
[null,"Test w klasie VIII"]
[]
[null,null,null,null,"WYPOWIEDŹ USTNA"]
[null,null,null,null,"Temat","Gramatyka","Słownictwo","Komunikatywność","SUMA"]
[{"$f":"C10&\", \"&D10","v":"0, 0"},1,{"$f":"'Informacje o klasie'!C14","v":0},{"$f":"'Informacje o klasie'!D14","v":0},null,null,null,null,{"$f":"SUM(E10:H10)","v":0}]
[{"$f":"C11&\", \"&D11","v":"0, 0"},2,{"$f":"'Informacje o klasie'!C15","v":0},{"$f":"'Informacje o klasie'!D15","v":0},null,null,null,null,{"$f":"SUM(E11:H11)","v":0}]
["0, 0",3,{"$f":"'Informacje o klasie'!C16","v":0},{"$f":"'Informacje o klasie'!D16","v":0},null,null,null,null,0]
["0, 0",4,{"$f":"'Informacje o klasie'!C17","v":0},{"$f":"'Informacje o klasie'!D17","v":0},null,null,null,null,0]
["0, 0",5,{"$f":"'Informacje o klasie'!C18","v":0},{"$f":"'Informacje o klasie'!D18","v":0},null,null,null,null,0]
["0, 0",6,{"$f":"'Informacje o klasie'!C19","v":0},{"$f":"'Informacje o klasie'!D19","v":0},null,null,null,null,0]
["0, 0",7,{"$f":"'Informacje o klasie'!C20","v":0},{"$f":"'Informacje o klasie'!D20","v":0},null,null,null,null,0]
["0, 0",8,{"$f":"'Informacje o klasie'!C21","v":0},{"$f":"'Informacje o klasie'!D21","v":0},null,null,null,null,0]
["0, 0",9,{"$f":"'Informacje o klasie'!C22","v":0},{"$f":"'Informacje o klasie'!D22","v":0},null,null,null,null,0]
["0, 0",10,{"$f":"'Informacje o klasie'!C23","v":0},{"$f":"'Informacje o klasie'!D23","v":0},null,null,null,null,0]
["0, 0",11,{"$f":"'Informacje o klasie'!C24","v":0},{"$f":"'Informacje o klasie'!D24","v":0},null,null,null,null,0]
["0, 0",12,{"$f":"'Informacje o klasie'!C25","v":0},{"$f":"'Informacje o klasie'!D25","v":0},null,null,null,null,0]
["0, 0",13,{"$f":"'Informacje o klasie'!C26","v":0},{"$f":"'Informacje o klasie'!D26","v":0},null,null,null,null,0]
["0, 0",14,{"$f":"'Informacje o klasie'!C27","v":0},{"$f":"'Informacje o klasie'!D27","v":0},null,null,null,null,0]
["0, 0",15,{"$f":"'Informacje o klasie'!C28","v":0},{"$f":"'Informacje o klasie'!D28","v":0},null,null,null,null,0]
["0, 0",16,{"$f":"'Informacje o klasie'!C29","v":0},{"$f":"'Informacje o klasie'!D29","v":0},null,null,null,null,0]
["0, 0",17,{"$f":"'Informacje o klasie'!C30","v":0},{"$f":"'Informacje o klasie'!D30","v":0},null,null,null,null,0]
["0, 0",18,{"$f":"'Informacje o klasie'!C31","v":0},{"$f":"'Informacje o klasie'!D31","v":0},null,null,null,null,0]
["0, 0",19,{"$f":"'Informacje o klasie'!C32","v":0},{"$f":"'Informacje o klasie'!D32","v":0},null,null,null,null,0]
["0, 0",20,{"$f":"'Informacje o klasie'!C33","v":0},{"$f":"'Informacje o klasie'!D33","v":0},null,null,null,null,0]
["0, 0",21,{"$f":"'Informacje o klasie'!C34","v":0},{"$f":"'Informacje o klasie'!D34","v":0},null,null,null,null,0]
["0, 0",22,{"$f":"'Informacje o klasie'!C35","v":0},{"$f":"'Informacje o klasie'!D35","v":0},null,null,null,null,0]
["0, 0",23,{"$f":"'Informacje o klasie'!C36","v":0},{"$f":"'Informacje o klasie'!D36","v":0},null,null,null,null,0]
["0, 0",24,{"$f":"'Informacje o klasie'!C37","v":0},{"$f":"'Informacje o klasie'!D37","v":0},null,null,null,null,0]
["0, 0",25,{"$f":"'Informacje o klasie'!C38","v":0},{"$f":"'Informacje o klasie'!D38","v":0},null,null,null,null,0]
["0, 0",26,{"$f":"'Informacje o klasie'!C39","v":0},{"$f":"'Informacje o klasie'!D39","v":0},null,null,null,null,0]
["0, 0",27,{"$f":"'Informacje o klasie'!C40","v":0},{"$f":"'Informacje o klasie'!D40","v":0},null,null,null,null,0]
["0, 0",28,{"$f":"'Informacje o klasie'!C41","v":0},{"$f":"'Informacje o klasie'!D41","v":0},null,null,null,null,0]
["0, 0",29,{"$f":"'Informacje o klasie'!C42","v":0},{"$f":"'Informacje o klasie'!D42","v":0},null,null,null,null,0]
["0, 0",30,{"$f":"'Informacje o klasie'!C43","v":0},{"$f":"'Informacje o klasie'!D43","v":0},null,null,null,null,0]
["0, 0",31,{"$f":"'Informacje o klasie'!C44","v":0},{"$f":"'Informacje o klasie'!D44","v":0},null,null,null,null,0]
["0, 0",32,{"$f":"'Informacje o klasie'!C45","v":0},{"$f":"'Informacje o klasie'!D45","v":0},null,null,null,null,0]
["0, 0",33,{"$f":"'Informacje o klasie'!C46","v":0},{"$f":"'Informacje o klasie'!D46","v":0},null,null,null,null,0]
["0, 0",34,{"$f":"'Informacje o klasie'!C47","v":0},{"$f":"'Informacje o klasie'!D47","v":0},null,null,null,null,0]
["0, 0",35,{"$f":"'Informacje o klasie'!C48","v":0},{"$f":"'Informacje o klasie'!D48","v":0},null,null,null,null,0]
["0, 0",36,{"$f":"'Informacje o klasie'!C49","v":0},{"$f":"'Informacje o klasie'!D49","v":0},null,null,null,null,0]
["0, 0",37,{"$f":"'Informacje o klasie'!C50","v":0},{"$f":"'Informacje o klasie'!D50","v":0},null,null,null,null,0]
["0, 0",38,{"$f":"'Informacje o klasie'!C51","v":0},{"$f":"'Informacje o klasie'!D51","v":0},null,null,null,null,0]
["0, 0",39,{"$f":"'Informacje o klasie'!C52","v":0},{"$f":"'Informacje o klasie'!D52","v":0},null,null,null,null,0]
["0, 0",40,{"$f":"'Informacje o klasie'!C53","v":0},{"$f":"'Informacje o klasie'!D53","v":0},null,null,null,null,0]
["0, 0",41,{"$f":"'Informacje o klasie'!C54","v":0},{"$f":"'Informacje o klasie'!D54","v":0},null,null,null,null,0]
["0, 0",42,{"$f":"'Informacje o klasie'!C55","v":0},{"$f":"'Informacje o klasie'!D55","v":0},null,null,null,null,0]
["0, 0",43,{"$f":"'Informacje o klasie'!C56","v":0},{"$f":"'Informacje o klasie'!D56","v":0},null,null,null,null,0]
["0, 0",44,{"$f":"'Informacje o klasie'!C57","v":0},{"$f":"'Informacje o klasie'!D57","v":0},null,null,null,null,0]
["0, 0",45,{"$f":"'Informacje o klasie'!C58","v":0},{"$f":"'Informacje o klasie'!D58","v":0},null,null,null,null,0]
["0, 0",46,{"$f":"'Informacje o klasie'!C59","v":0},{"$f":"'Informacje o klasie'!D59","v":0},null,null,null,null,0]
["0, 0",47,{"$f":"'Informacje o klasie'!C60","v":0},{"$f":"'Informacje o klasie'!D60","v":0},null,null,null,null,0]
["0, 0",48,{"$f":"'Informacje o klasie'!C61","v":0},{"$f":"'Informacje o klasie'!D61","v":0},null,null,null,null,0]
["0, 0",49,{"$f":"'Informacje o klasie'!C62","v":0},{"$f":"'Informacje o klasie'!D62","v":0},null,null,null,null,0]
["0, 0",50,{"$f":"'Informacje o klasie'!C63","v":0},{"$f":"'Informacje o klasie'!D63","v":0},null,null,null,null,0]
["0, 0",51,{"$f":"'Informacje o klasie'!C64","v":0},{"$f":"'Informacje o klasie'!D64","v":0},null,null,null,null,0]
["0, 0",52,{"$f":"'Informacje o klasie'!C65","v":0},{"$f":"'Informacje o klasie'!D65","v":0},null,null,null,null,0]
["0, 0",53,{"$f":"'Informacje o klasie'!C66","v":0},{"$f":"'Informacje o klasie'!D66","v":0},null,null,null,null,0]
["0, 0",54,{"$f":"'Informacje o klasie'!C67","v":0},{"$f":"'Informacje o klasie'!D67","v":0},null,null,null,null,0]
["0, 0",55,{"$f":"'Informacje o klasie'!C68","v":0},{"$f":"'Informacje o klasie'!D68","v":0},null,null,null,null,0]
["0, 0",56,{"$f":"'Informacje o klasie'!C69","v":0},{"$f":"'Informacje o klasie'!D69","v":0},null,null,null,null,0]
["0, 0",57,{"$f":"'Informacje o klasie'!C70","v":0},{"$f":"'Informacje o klasie'!D70","v":0},null,null,null,null,0]
["0, 0",58,{"$f":"'Informacje o klasie'!C71","v":0},{"$f":"'Informacje o klasie'!D71","v":0},null,null,null,null,0]
["0, 0",59,{"$f":"'Informacje o klasie'!C72","v":0},{"$f":"'Informacje o klasie'!D72","v":0},null,null,null,null,0]
["0, 0",60,{"$f":"'Informacje o klasie'!C73","v":0},{"$f":"'Informacje o klasie'!D73","v":0},null,null,null,null,0]
["0, 0",61,{"$f":"'Informacje o klasie'!C74","v":0},{"$f":"'Informacje o klasie'!D74","v":0},null,null,null,null,0]
["0, 0",62,{"$f":"'Informacje o klasie'!C75","v":0},{"$f":"'Informacje o klasie'!D75","v":0},null,null,null,null,0]
["0, 0",63,{"$f":"'Informacje o klasie'!C76","v":0},{"$f":"'Informacje o klasie'!D76","v":0},null,null,null,null,0]
["0, 0",64,{"$f":"'Informacje o klasie'!C77","v":0},{"$f":"'Informacje o klasie'!D77","v":0},null,null,null,null,0]
["0, 0",65,{"$f":"'Informacje o klasie'!C78","v":0},{"$f":"'Informacje o klasie'!D78","v":0},null,null,null,null,0]
[{"$f":"C75&\", \"&D75","v":"0, 0"},66,{"$f":"'Informacje o klasie'!C79","v":0},{"$f":"'Informacje o klasie'!D79","v":0},null,null,null,null,{"$f":"SUM(E75:H75)","v":0}]
["0, 0",67,{"$f":"'Informacje o klasie'!C80","v":0},{"$f":"'Informacje o klasie'!D80","v":0},null,null,null,null,0]
["0, 0",68,{"$f":"'Informacje o klasie'!C81","v":0},{"$f":"'Informacje o klasie'!D81","v":0},null,null,null,null,0]
["0, 0",69,{"$f":"'Informacje o klasie'!C82","v":0},{"$f":"'Informacje o klasie'!D82","v":0},null,null,null,null,0]
["0, 0",70,{"$f":"'Informacje o klasie'!C83","v":0},{"$f":"'Informacje o klasie'!D83","v":0},null,null,null,null,0]
["0, 0",71,{"$f":"'Informacje o klasie'!C84","v":0},{"$f":"'Informacje o klasie'!D84","v":0},null,null,null,null,0]
["0, 0",72,{"$f":"'Informacje o klasie'!C85","v":0},{"$f":"'Informacje o klasie'!D85","v":0},null,null,null,null,0]
["0, 0",73,{"$f":"'Informacje o klasie'!C86","v":0},{"$f":"'Informacje o klasie'!D86","v":0},null,null,null,null,0]
["0, 0",74,{"$f":"'Informacje o klasie'!C87","v":0},{"$f":"'Informacje o klasie'!D87","v":0},null,null,null,null,0]
["0, 0",75,{"$f":"'Informacje o klasie'!C88","v":0},{"$f":"'Informacje o klasie'!D88","v":0},null,null,null,null,0]
["0, 0",76,{"$f":"'Informacje o klasie'!C89","v":0},{"$f":"'Informacje o klasie'!D89","v":0},null,null,null,null,0]
["0, 0",77,{"$f":"'Informacje o klasie'!C90","v":0},{"$f":"'Informacje o klasie'!D90","v":0},null,null,null,null,0]
["0, 0",78,{"$f":"'Informacje o klasie'!C91","v":0},{"$f":"'Informacje o klasie'!D91","v":0},null,null,null,null,0]
["0, 0",79,{"$f":"'Informacje o klasie'!C92","v":0},{"$f":"'Informacje o klasie'!D92","v":0},null,null,null,null,0]
["0, 0",80,{"$f":"'Informacje o klasie'!C93","v":0},{"$f":"'Informacje o klasie'!D93","v":0},null,null,null,null,0]
["0, 0",81,{"$f":"'Informacje o klasie'!C94","v":0},{"$f":"'Informacje o klasie'!D94","v":0},null,null,null,null,0]
["0, 0",82,{"$f":"'Informacje o klasie'!C95","v":0},{"$f":"'Informacje o klasie'!D95","v":0},null,null,null,null,0]
["0, 0",83,{"$f":"'Informacje o klasie'!C96","v":0},{"$f":"'Informacje o klasie'!D96","v":0},null,null,null,null,0]
["0, 0",84,{"$f":"'Informacje o klasie'!C97","v":0},{"$f":"'Informacje o klasie'!D97","v":0},null,null,null,null,0]
["0, 0",85,{"$f":"'Informacje o klasie'!C98","v":0},{"$f":"'Informacje o klasie'!D98","v":0},null,null,null,null,0]
["0, 0",86,{"$f":"'Informacje o klasie'!C99","v":0},{"$f":"'Informacje o klasie'!D99","v":0},null,null,null,null,0]
["0, 0",87,{"$f":"'Informacje o klasie'!C100","v":0},{"$f":"'Informacje o klasie'!D100","v":0},null,null,null,null,0]
["0, 0",88,{"$f":"'Informacje o klasie'!C101","v":0},{"$f":"'Informacje o klasie'!D101","v":0},null,null,null,null,0]
["0, 0",89,{"$f":"'Informacje o klasie'!C102","v":0},{"$f":"'Informacje o klasie'!D102","v":0},null,null,null,null,0]
["0, 0",90,{"$f":"'Informacje o klasie'!C103","v":0},{"$f":"'Informacje o klasie'!D103","v":0},null,null,null,null,0]
["0, 0",91,{"$f":"'Informacje o klasie'!C104","v":0},{"$f":"'Informacje o klasie'!D104","v":0},null,null,null,null,0]
["0, 0",92,{"$f":"'Informacje o klasie'!C105","v":0},{"$f":"'Informacje o klasie'!D105","v":0},null,null,null,null,0]
["0, 0",93,{"$f":"'Informacje o klasie'!C106","v":0},{"$f":"'Informacje o klasie'!D106","v":0},null,null,null,null,0]
["0, 0",94,{"$f":"'Informacje o klasie'!C107","v":0},{"$f":"'Informacje o klasie'!D107","v":0},null,null,null,null,0]
["0, 0",95,{"$f":"'Informacje o klasie'!C108","v":0},{"$f":"'Informacje o klasie'!D108","v":0},null,null,null,null,0]
["0, 0",96,{"$f":"'Informacje o klasie'!C109","v":0},{"$f":"'Informacje o klasie'!D109","v":0},null,null,null,null,0]
["0, 0",97,{"$f":"'Informacje o klasie'!C110","v":0},{"$f":"'Informacje o klasie'!D110","v":0},null,null,null,null,0]
["0, 0",98,{"$f":"'Informacje o klasie'!C111","v":0},{"$f":"'Informacje o klasie'!D111","v":0},null,null,null,null,0]
["0, 0",99,{"$f":"'Informacje o klasie'!C112","v":0},{"$f":"'Informacje o klasie'!D112","v":0},null,null,null,null,0]
[]
[]
[]
[]
[]
[]
[null,null,null,"Current level"]
[null,null,null,{"$f":"Validation!J2","v":"Diagnostic test 2"}]
[null,null,null,{"$f":"Validation!J3","v":0}]
[null,null,null,{"$f":"Validation!J4","v":0}]
[null,null,null,{"$f":"Validation!J5","v":0}]
[null,null,null,{"$f":"Validation!J6","v":0}]
[]
[]
[]
[]
[null,1,{"$f":"C10","v":0},{"$f":"D10","v":0}]
[null,2,{"$f":"C11","v":0},0]
[null,3,0,0]
[null,4,0,0]
[null,5,0,0]
[null,6,0,0]
[null,7,0,0]
[null,8,0,0]
[null,9,0,0]
[null,10,0,0]
[null,11,0,0]
[null,12,0,0]
[null,13,0,0]
[null,14,0,0]
[null,15,0,0]
[null,16,0,0]
[null,17,0,0]
[null,18,{"$f":"C27","v":0},0]
[null,19,0,0]
[null,20,0,0]
[null,21,0,0]
[null,22,0,0]
[null,23,0,0]
[null,24,0,0]
[null,25,0,0]
[null,26,0,0]
[null,27,0,0]
[null,28,0,0]
[null,29,0,0]
[null,30,0,0]
[null,31,0,0]
[null,32,0,0]
[null,33,0,0]
[null,34,{"$f":"C43","v":0},0]
[null,35,0,0]
[null,36,0,0]
[null,37,0,0]
[null,38,0,0]
[null,39,0,0]
[null,40,0,0]
[null,41,0,0]
[null,42,0,0]
[null,43,0,0]
[null,44,0,0]
[null,45,0,0]
[null,46,0,0]
[null,47,0,0]
[null,48,0,0]
[null,49,0,0]
[null,50,{"$f":"C59","v":0},0]
[null,51,0,0]
[null,52,0,0]
[null,53,0,0]
[null,54,0,0]
[null,55,0,0]
[null,56,0,0]
[null,57,0,0]
[null,58,0,0]
[null,59,0,0]
[null,60,0,0]
[null,61,0,0]
[null,62,0,0]
[null,63,0,0]
[null,64,0,0]
[null,65,0,0]
[null,66,{"$f":"C75","v":0},0]
[null,67,0,0]
[null,68,0,0]
[null,69,0,0]
[null,70,0,0]
[null,71,0,0]
[null,72,0,0]
[null,73,0,0]
[null,74,0,0]
[null,75,0,0]
[null,76,0,0]
[null,77,0,0]
[null,78,0,0]
[null,79,0,0]
[null,80,0,0]
[null,81,0,0]
[null,82,{"$f":"C91","v":0},0]
[null,83,0,0]
[null,84,0,0]
[null,85,0,0]
[null,86,0,0]
[null,87,0,0]
[null,88,0,0]
[null,89,0,0]
[null,90,0,0]
[null,91,0,0]
[null,92,0,0]
[null,93,0,0]
[null,94,0,0]
[null,95,0,0]
[null,96,0,0]
[null,97,0,0]
[null,98,{"$f":"C107","v":0},0]
[null,99,0,0]
[null,null,null,null,null,{"$f":"SUM(F10:F108)","v":0},{"$f":"SUM(G10:G108)","v":0},{"$f":"SUM(H10:H108)","v":0},{"$f":"SUM(I10:I108)","v":0}]
[null,null,null,null,null,{"$f":"((F224/'Informacje o klasie'!$C$11)/3)","v":{"$error":"#DIV/0!"}},{"$f":"((G224/'Informacje o klasie'!$C$11)/3)","v":{"$error":"#DIV/0!"}},{"$f":"((H224/'Informacje o klasie'!$C$11)/4)","v":{"$error":"#DIV/0!"}}]
[null,null,null,null,null,null,null,null,{"$f":"ROUND(I224/'Informacje o klasie'!$C$11,0)","v":{"$error":"#DIV/0!"}}]

{"sheet":"Raport ucznia","index":6,"n_rows":36,"n_cols":10,"rows_kept":36,"cut":false,"hidden":false,"merged":[[14,0,14,6],[16,0,16,6],[12,0,12,6],[2,2,2,5],[3,2,3,5],[8,0,8,6],[10,0,10,6]]}
[]
["Test diagnostyczny 5",null,null,null,"Raport ucznia"]
["Nazwisko ucznia",null,null,null,null,null,"Klasa/Grupa",null,{"$f":"'Informacje o klasie'!C4","v":0}]
["Data raportu",null,{"$f":"TODAY()","v":"2021-10-04"},null,null,null,"Podręcznik",null,{"$f":"'Informacje o klasie'!C6","v":0}]
["Test w klasie ",null,"VIII"]
["Data testu  ",null,{"$f":"IF(AND(ISBLANK('Informacje o klasie'!$C$10),ISBLANK('Informacje o klasie'!$C$9),ISBLANK('Informacje o klasie'!$C$8)),\"\",\nIF(AND(ISBLANK('Informacje o klasie'!$C$10),ISBLANK('Informacje o klasie'!$C$9)),\"S1: \"&'Informacje o klasie'!$C$8,\nIF(ISBLANK('Informacje o klasie'!$C$10),\"S1: \"&'Informacje o klasie'!$C$8&\"; S2: \"&'Informacje o klasie'!$C$9,\n\"S1: \"&'Informacje o klasie'!$C$8&\"; S2: \"&'Informacje o klasie'!$C$9&\"; S3: \"&'Informacje o klasie'!$C$10)))","v":""}]
[]
[{"$f":"'Wyniki z Sekcji 1'!E8","v":"ROZUMIENIE ZE SŁUCHU"},"Punkty ucznia",{"$f":"IFERROR(INDEX('Wyniki z Sekcji 1'!$O:$O,MATCH('Raport ucznia'!$C$3,'Wyniki z Sekcji 1'!$A:$A,0)),0)","v":0},"Średnia klasy/grupy",{"$f":"IFERROR('Wyniki z Sekcji 1'!$O$226,\"\")","v":""},"Maks. liczba punktów",10]
["Rozumienie prostych wypowiedzi ustnych \nZnajdowanie określonych informacji w wypowiedzi"]
[{"$f":"'Wyniki z Sekcji 1'!P8","v":"ROZUMIENIE TEKSTÓW PISANYCH"},"Punkty ucznia",{"$f":"IFERROR(INDEX('Wyniki z Sekcji 1'!$Z:$Z,MATCH('Raport ucznia'!$C$3,'Wyniki z Sekcji 1'!$A:$A,0)),0)","v":0},"Średnia klasy/grupy",{"$f":"IFERROR('Wyniki z Sekcji 1'!$Z$226,\"\")","v":""},"Maks. liczba punktów",10]
["Rozumienie prostych wypowiedzi pisemnych\nZnajdowanie określonych informacji w tekście"]
[{"$f":"'Wyniki z Sekcji 2'!E8","v":"ZNAJOMOŚĆ ŚRODKÓW I FUNKCJI JĘZYKOWYCH"},"Punkty ucznia",{"$f":"IFERROR(INDEX('Wyniki z Sekcji 2'!$O:$O,MATCH('Raport ucznia'!$C$3,'Wyniki z Sekcji 2'!$A:$A,0)),0)","v":0},"Średnia klasy/grupy",{"$f":"IFERROR('Wyniki z Sekcji 2'!$O$226,\"\")","v":""},"Maks. liczba punktów",10]
["Posługiwanie się podstawowym zasobem środków językowych w zakresie następujących tematów: człowiek, życie prywatne, sport, świat przyrody"]
[{"$f":"'Wyniki z Sekcji 2'!P8","v":"WYPOWIEDŹ PISEMNA"},"Punkty ucznia",{"$f":"IFERROR(INDEX('Wyniki z Sekcji 2'!$U:$U,MATCH('Raport ucznia'!$C$3,'Wyniki z Sekcji 2'!$A:$A,0)),0)","v":0},"Średnia klasy/grupy",{"$f":"IFERROR('Wyniki z Sekcji 2'!$U$226,\"\")","v":""},"Maks. liczba punktów",10]
["Tworzenie krótkiej, prostej spójnej i logicznej wypowiedzi pisemnej"]
[{"$f":"'Wyniki z Sekcji 3'!E8","v":"WYPOWIEDŹ USTNA"},"Punkty ucznia",{"$f":"IFERROR(INDEX('Wyniki z Sekcji 3'!I:I,MATCH('Raport ucznia'!$C$3,'Wyniki z Sekcji 3'!A:A,0)),0)","v":0},"Średnia klasy/grupy",{"$f":"IFERROR('Wyniki z Sekcji 3'!$I$226,\"\")","v":""},"Maks. liczba punktów",10]
["Tworzenie krótkiej, prostej, spójnej i logicznej wypowiedzi ustnej"]
["SUMA ","Punkty ucznia ",{"$f":"C8+C10+C12+C14+C16","v":0},"Średnia klasy/grupy",{"$f":"IFERROR(E8+E10+E12+E14+E16,\"\")","v":""},"Maks. liczba punktów",50]
[]
[]
[]
[]
[]
[]
[]
[]
[]
[]
[]
[]
[]
[null,null,null,null,{"$f":"A8","v":"ROZUMIENIE ZE SŁUCHU"},{"$f":"A10","v":"ROZUMIENIE TEKSTÓW PISANYCH"},{"$f":"A12","v":"ZNAJOMOŚĆ ŚRODKÓW I FUNKCJI JĘZYKOWYCH"},{"$f":"A14","v":"WYPOWIEDŹ PISEMNA"},{"$f":"A16","v":"WYPOWIEDŹ USTNA"},"Total"]
[null,null,null,null,{"$f":"G8","v":10},{"$f":"G10","v":10},{"$f":"G12","v":10},{"$f":"G14","v":10},{"$f":"G16","v":10},{"$f":"G18","v":50}]
[null,null,null,null,{"$f":"C8","v":0},{"$f":"C10","v":0},{"$f":"C12","v":0},{"$f":"C14","v":0},{"$f":"C16","v":0},{"$f":"C18","v":0}]
[]
[null,null,null,null,{"$f":"E34/E33","v":0},0,0,0,0,0]

{"sheet":"Raport klasy - ogólny","index":7,"n_rows":118,"n_cols":9,"rows_kept":118,"cut":false,"hidden":false,"merged":[[11,0,11,8],[13,0,13,8],[15,0,15,8],[17,0,17,8],[19,0,19,8]]}
[]
[{"$f":"\"Test diagnostyczny 5\"","v":"Test diagnostyczny 5"},null,"Raport klasy - tabele"]
["Klasa/Grupa",null,{"$f":"'Informacje o klasie'!C4","v":0}]
["Data raportu",null,{"$f":"TODAY()","v":"2021-10-04"},null,"Podręcznik",null,{"$f":"'Informacje o klasie'!C6","v":0}]
["Test w klasie ",null,"VIII"]
["Data testu",null,{"$f":"IF(AND(ISBLANK('Informacje o klasie'!$C$10),ISBLANK('Informacje o klasie'!$C$9),ISBLANK('Informacje o klasie'!$C$8)),\"\",\nIF(AND(ISBLANK('Informacje o klasie'!$C$10),ISBLANK('Informacje o klasie'!$C$9)),\"S1: \"&'Informacje o klasie'!$C$8,\nIF(ISBLANK('Informacje o klasie'!$C$10),\"S1: \"&'Informacje o klasie'!$C$8&\"; S2: \"&'Informacje o klasie'!$C$9,\n\"S1: \"&'Informacje o klasie'!$C$8&\"; S2: \"&'Informacje o klasie'!$C$9&\"; S3: \"&'Informacje o klasie'!$C$10)))","v":""}]
["Najniższa liczba punktów w klasie/grupie",null,{"$f":"IFERROR(SMALL(H22:H118,COUNTIF(H22:H118,0)+1),\"\")","v":""}]
["Najwyższa liczba punktów w klasie/grupie",null,{"$f":"MAX(H22:H118)","v":0}]
["Średnia liczba punktów w klasie/grupie",null,{"$f":"IFERROR(ROUND(SUM(H22:H118)/'Informacje o klasie'!C11,0),\"\")","v":""}]
[]
[{"$f":"'Raport ucznia'!A8","v":"ROZUMIENIE ZE SŁUCHU"},"Najniższa liczba punktów",{"$f":"IFERROR(SMALL(C$22:C$118,COUNTIF(C$22:C$118,0)+1),\"\")","v":""},"Najwyższa liczba punktów",{"$f":"MAX(C$22:C$118)","v":0},"Średnia klasy/grupy",{"$f":"IFERROR(ROUND(SUM(C$22:C$118)/'Informacje o klasie'!$C$11,0),\"\")","v":""},"Maks. liczba punktów",10]
[{"$f":"'Raport ucznia'!A9:G9","v":"Rozumienie prostych wypowiedzi ustnych \nZnajdowanie określonych informacji w wypowiedzi"}]
[{"$f":"'Raport ucznia'!A10","v":"ROZUMIENIE TEKSTÓW PISANYCH"},"Najniższa liczba punktów",{"$f":"IFERROR(SMALL(D$22:D$118,COUNTIF(D$22:D$118,0)+1),\"\")","v":""},"Najwyższa liczba punktów",{"$f":"MAX(D$22:D$118)","v":0},"Średnia klasy/grupy",{"$f":"IFERROR(ROUND(SUM(D$22:D$118)/'Informacje o klasie'!$C$11,0),\"\")","v":""},"Maks. liczba punktów",10]
[{"$f":"'Raport ucznia'!A11:G11","v":"Rozumienie prostych wypowiedzi pisemnych\nZnajdowanie określonych informacji w tekście"}]
[{"$f":"'Raport ucznia'!A12","v":"ZNAJOMOŚĆ ŚRODKÓW I FUNKCJI JĘZYKOWYCH"},"Najniższa liczba punktów",{"$f":"IFERROR(SMALL(E$22:E$118,COUNTIF(E$22:E$118,0)+1),\"\")","v":""},"Najwyższa liczba punktów",{"$f":"MAX(E$22:E$118)","v":0},"Średnia klasy/grupy",{"$f":"IFERROR(ROUND(SUM(E$22:E$118)/'Informacje o klasie'!$C$11,0),\"\")","v":""},"Maks. liczba punktów",10]
[{"$f":"'Raport ucznia'!A13:G13","v":"Posługiwanie się podstawowym zasobem środków językowych w zakresie następujących tematów: człowiek, życie prywatne, sport, świat przyrody"}]
[{"$f":"'Raport ucznia'!A14","v":"WYPOWIEDŹ PISEMNA"},"Najniższa liczba punktów",{"$f":"IFERROR(SMALL(F$22:F$118,COUNTIF(F$22:F$118,0)+1),\"\")","v":""},"Najwyższa liczba punktów",{"$f":"MAX(F$22:F$118)","v":0},"Średnia klasy/grupy",{"$f":"IFERROR(ROUND(SUM(F$22:F$118)/'Informacje o klasie'!$C$11,0),\"\")","v":""},"Maks. liczba punktów",10]
[{"$f":"'Raport ucznia'!A15:G15","v":"Tworzenie krótkiej, prostej spójnej i logicznej wypowiedzi pisemnej"}]
[{"$f":"'Raport ucznia'!A16","v":"WYPOWIEDŹ USTNA"},"Najniższa liczba punktów",{"$f":"IFERROR(SMALL(G$22:G$118,COUNTIF(G$22:G$118,0)+1),\"\")","v":""},"Najwyższa liczba punktów",{"$f":"MAX(G$22:G$118)","v":0},"Średnia klasy/grupy",{"$f":"IFERROR(ROUND(SUM(G$22:G$118)/'Informacje o klasie'!$C$11,0),\"\")","v":""},"Maks. liczba punktów",10]
[{"$f":"'Raport ucznia'!A17:G17","v":"Tworzenie krótkiej, prostej, spójnej i logicznej wypowiedzi ustnej"}]
["Numer ","Imię i nazwisko",{"$f":"A11","v":"ROZUMIENIE ZE SŁUCHU"},{"$f":"A13","v":"ROZUMIENIE TEKSTÓW PISANYCH"},{"$f":"A15","v":"ZNAJOMOŚĆ ŚRODKÓW I FUNKCJI JĘZYKOWYCH"},{"$f":"A17","v":"WYPOWIEDŹ PISEMNA"},{"$f":"A19","v":"WYPOWIEDŹ USTNA"},"SUMA","%"]
[{"$f":"IF(ISBLANK('Informacje o klasie'!C14),\"\",('Informacje o klasie'!B14))","v":""},{"$f":"IF(ISBLANK('Informacje o klasie'!C14),\"\",UPPER('Informacje o klasie'!C14)&\", \"&'Informacje o klasie'!D14)","v":""},{"$f":"'Wyniki z Sekcji 1'!O10","v":0},{"$f":"'Wyniki z Sekcji 1'!Z10","v":0},{"$f":"'Wyniki z Sekcji 2'!O10","v":0},{"$f":"'Wyniki z Sekcji 2'!U10","v":0},{"$f":"'Wyniki z Sekcji 3'!I10","v":0},{"$f":"SUM(C22:G22)","v":0},{"$f":"H22/50","v":0}]
[{"$f":"IF(ISBLANK('Informacje o klasie'!C15),\"\",('Informacje o klasie'!B15))","v":""},{"$f":"IF(ISBLANK('Informacje o klasie'!C15),\"\",UPPER('Informacje o klasie'!C15)&\", \"&'Informacje o klasie'!D15)","v":""},{"$f":"'Wyniki z Sekcji 1'!O11","v":0},{"$f":"'Wyniki z Sekcji 1'!Z11","v":0},{"$f":"'Wyniki z Sekcji 2'!O11","v":0},{"$f":"'Wyniki z Sekcji 2'!U11","v":0},{"$f":"'Wyniki z Sekcji 3'!I11","v":0},{"$f":"SUM(C23:G23)","v":0},{"$f":"H23/50","v":0}]
[{"$f":"IF(ISBLANK('Informacje o klasie'!C16),\"\",('Informacje o klasie'!B16))","v":""},{"$f":"IF(ISBLANK('Informacje o klasie'!C16),\"\",UPPER('Informacje o klasie'!C16)&\", \"&'Informacje o klasie'!D16)","v":""},{"$f":"'Wyniki z Sekcji 1'!O12","v":0},{"$f":"'Wyniki z Sekcji 1'!Z12","v":0},{"$f":"'Wyniki z Sekcji 2'!O12","v":0},{"$f":"'Wyniki z Sekcji 2'!U12","v":0},{"$f":"'Wyniki z Sekcji 3'!I12","v":0},0,0]
[{"$f":"IF(ISBLANK('Informacje o klasie'!C17),\"\",('Informacje o klasie'!B17))","v":""},{"$f":"IF(ISBLANK('Informacje o klasie'!C17),\"\",UPPER('Informacje o klasie'!C17)&\", \"&'Informacje o klasie'!D17)","v":""},{"$f":"'Wyniki z Sekcji 1'!O13","v":0},{"$f":"'Wyniki z Sekcji 1'!Z13","v":0},{"$f":"'Wyniki z Sekcji 2'!O13","v":0},{"$f":"'Wyniki z Sekcji 2'!U13","v":0},{"$f":"'Wyniki z Sekcji 3'!I13","v":0},0,0]
[{"$f":"IF(ISBLANK('Informacje o klasie'!C18),\"\",('Informacje o klasie'!B18))","v":""},{"$f":"IF(ISBLANK('Informacje o klasie'!C18),\"\",UPPER('Informacje o klasie'!C18)&\", \"&'Informacje o klasie'!D18)","v":""},{"$f":"'Wyniki z Sekcji 1'!O14","v":0},{"$f":"'Wyniki z Sekcji 1'!Z14","v":0},{"$f":"'Wyniki z Sekcji 2'!O14","v":0},{"$f":"'Wyniki z Sekcji 2'!U14","v":0},{"$f":"'Wyniki z Sekcji 3'!I14","v":0},0,0]
[{"$f":"IF(ISBLANK('Informacje o klasie'!C19),\"\",('Informacje o klasie'!B19))","v":""},{"$f":"IF(ISBLANK('Informacje o klasie'!C19),\"\",UPPER('Informacje o klasie'!C19)&\", \"&'Informacje o klasie'!D19)","v":""},{"$f":"'Wyniki z Sekcji 1'!O15","v":0},{"$f":"'Wyniki z Sekcji 1'!Z15","v":0},{"$f":"'Wyniki z Sekcji 2'!O15","v":0},{"$f":"'Wyniki z Sekcji 2'!U15","v":0},{"$f":"'Wyniki z Sekcji 3'!I15","v":0},0,0]
[{"$f":"IF(ISBLANK('Informacje o klasie'!C20),\"\",('Informacje o klasie'!B20))","v":""},{"$f":"IF(ISBLANK('Informacje o klasie'!C20),\"\",UPPER('Informacje o klasie'!C20)&\", \"&'Informacje o klasie'!D20)","v":""},{"$f":"'Wyniki z Sekcji 1'!O16","v":0},{"$f":"'Wyniki z Sekcji 1'!Z16","v":0},{"$f":"'Wyniki z Sekcji 2'!O16","v":0},{"$f":"'Wyniki z Sekcji 2'!U16","v":0},{"$f":"'Wyniki z Sekcji 3'!I16","v":0},0,0]
[{"$f":"IF(ISBLANK('Informacje o klasie'!C21),\"\",('Informacje o klasie'!B21))","v":""},{"$f":"IF(ISBLANK('Informacje o klasie'!C21),\"\",UPPER('Informacje o klasie'!C21)&\", \"&'Informacje o klasie'!D21)","v":""},{"$f":"'Wyniki z Sekcji 1'!O17","v":0},{"$f":"'Wyniki z Sekcji 1'!Z17","v":0},{"$f":"'Wyniki z Sekcji 2'!O17","v":0},{"$f":"'Wyniki z Sekcji 2'!U17","v":0},{"$f":"'Wyniki z Sekcji 3'!I17","v":0},0,0]
[{"$f":"IF(ISBLANK('Informacje o klasie'!C22),\"\",('Informacje o klasie'!B22))","v":""},{"$f":"IF(ISBLANK('Informacje o klasie'!C22),\"\",UPPER('Informacje o klasie'!C22)&\", \"&'Informacje o klasie'!D22)","v":""},{"$f":"'Wyniki z Sekcji 1'!O18","v":0},{"$f":"'Wyniki z Sekcji 1'!Z18","v":0},{"$f":"'Wyniki z Sekcji 2'!O18","v":0},{"$f":"'Wyniki z Sekcji 2'!U18","v":0},{"$f":"'Wyniki z Sekcji 3'!I18","v":0},0,0]
[{"$f":"IF(ISBLANK('Informacje o klasie'!C23),\"\",('Informacje o klasie'!B23))","v":""},{"$f":"IF(ISBLANK('Informacje o klasie'!C23),\"\",UPPER('Informacje o klasie'!C23)&\", \"&'Informacje o klasie'!D23)","v":""},{"$f":"'Wyniki z Sekcji 1'!O19","v":0},{"$f":"'Wyniki z Sekcji 1'!Z19","v":0},{"$f":"'Wyniki z Sekcji 2'!O19","v":0},{"$f":"'Wyniki z Sekcji 2'!U19","v":0},{"$f":"'Wyniki z Sekcji 3'!I19","v":0},0,0]
[{"$f":"IF(ISBLANK('Informacje o klasie'!C24),\"\",('Informacje o klasie'!B24))","v":""},{"$f":"IF(ISBLANK('Informacje o klasie'!C24),\"\",UPPER('Informacje o klasie'!C24)&\", \"&'Informacje o klasie'!D24)","v":""},{"$f":"'Wyniki z Sekcji 1'!O20","v":0},{"$f":"'Wyniki z Sekcji 1'!Z20","v":0},{"$f":"'Wyniki z Sekcji 2'!O20","v":0},{"$f":"'Wyniki z Sekcji 2'!U20","v":0},{"$f":"'Wyniki z Sekcji 3'!I20","v":0},0,0]
[{"$f":"IF(ISBLANK('Informacje o klasie'!C25),\"\",('Informacje o klasie'!B25))","v":""},{"$f":"IF(ISBLANK('Informacje o klasie'!C25),\"\",UPPER('Informacje o klasie'!C25)&\", \"&'Informacje o klasie'!D25)","v":""},{"$f":"'Wyniki z Sekcji 1'!O21","v":0},{"$f":"'Wyniki z Sekcji 1'!Z21","v":0},{"$f":"'Wyniki z Sekcji 2'!O21","v":0},{"$f":"'Wyniki z Sekcji 2'!U21","v":0},{"$f":"'Wyniki z Sekcji 3'!I21","v":0},0,0]
[{"$f":"IF(ISBLANK('Informacje o klasie'!C26),\"\",('Informacje o klasie'!B26))","v":""},{"$f":"IF(ISBLANK('Informacje o klasie'!C26),\"\",UPPER('Informacje o klasie'!C26)&\", \"&'Informacje o klasie'!D26)","v":""},{"$f":"'Wyniki z Sekcji 1'!O22","v":0},{"$f":"'Wyniki z Sekcji 1'!Z22","v":0},{"$f":"'Wyniki z Sekcji 2'!O22","v":0},{"$f":"'Wyniki z Sekcji 2'!U22","v":0},{"$f":"'Wyniki z Sekcji 3'!I22","v":0},0,0]
[{"$f":"IF(ISBLANK('Informacje o klasie'!C27),\"\",('Informacje o klasie'!B27))","v":""},{"$f":"IF(ISBLANK('Informacje o klasie'!C27),\"\",UPPER('Informacje o klasie'!C27)&\", \"&'Informacje o klasie'!D27)","v":""},{"$f":"'Wyniki z Sekcji 1'!O23","v":0},{"$f":"'Wyniki z Sekcji 1'!Z23","v":0},{"$f":"'Wyniki z Sekcji 2'!O23","v":0},{"$f":"'Wyniki z Sekcji 2'!U23","v":0},{"$f":"'Wyniki z Sekcji 3'!I23","v":0},0,0]
[{"$f":"IF(ISBLANK('Informacje o klasie'!C28),\"\",('Informacje o klasie'!B28))","v":""},{"$f":"IF(ISBLANK('Informacje o klasie'!C28),\"\",UPPER('Informacje o klasie'!C28)&\", \"&'Informacje o klasie'!D28)","v":""},{"$f":"'Wyniki z Sekcji 1'!O24","v":0},{"$f":"'Wyniki z Sekcji 1'!Z24","v":0},{"$f":"'Wyniki z Sekcji 2'!O24","v":0},{"$f":"'Wyniki z Sekcji 2'!U24","v":0},{"$f":"'Wyniki z Sekcji 3'!I24","v":0},0,0]
[{"$f":"IF(ISBLANK('Informacje o klasie'!C29),\"\",('Informacje o klasie'!B29))","v":""},{"$f":"IF(ISBLANK('Informacje o klasie'!C29),\"\",UPPER('Informacje o klasie'!C29)&\", \"&'Informacje o klasie'!D29)","v":""},{"$f":"'Wyniki z Sekcji 1'!O25","v":0},{"$f":"'Wyniki z Sekcji 1'!Z25","v":0},{"$f":"'Wyniki z Sekcji 2'!O25","v":0},{"$f":"'Wyniki z Sekcji 2'!U25","v":0},{"$f":"'Wyniki z Sekcji 3'!I25","v":0},0,0]
[{"$f":"IF(ISBLANK('Informacje o klasie'!C30),\"\",('Informacje o klasie'!B30))","v":""},{"$f":"IF(ISBLANK('Informacje o klasie'!C30),\"\",UPPER('Informacje o klasie'!C30)&\", \"&'Informacje o klasie'!D30)","v":""},{"$f":"'Wyniki z Sekcji 1'!O26","v":0},{"$f":"'Wyniki z Sekcji 1'!Z26","v":0},{"$f":"'Wyniki z Sekcji 2'!O26","v":0},{"$f":"'Wyniki z Sekcji 2'!U26","v":0},{"$f":"'Wyniki z Sekcji 3'!I26","v":0},0,0]
[{"$f":"IF(ISBLANK('Informacje o klasie'!C31),\"\",('Informacje o klasie'!B31))","v":""},{"$f":"IF(ISBLANK('Informacje o klasie'!C31),\"\",UPPER('Informacje o klasie'!C31)&\", \"&'Informacje o klasie'!D31)","v":""},{"$f":"'Wyniki z Sekcji 1'!O27","v":0},{"$f":"'Wyniki z Sekcji 1'!Z27","v":0},{"$f":"'Wyniki z Sekcji 2'!O27","v":0},{"$f":"'Wyniki z Sekcji 2'!U27","v":0},{"$f":"'Wyniki z Sekcji 3'!I27","v":0},0,0]
[{"$f":"IF(ISBLANK('Informacje o klasie'!C32),\"\",('Informacje o klasie'!B32))","v":""},{"$f":"IF(ISBLANK('Informacje o klasie'!C32),\"\",UPPER('Informacje o klasie'!C32)&\", \"&'Informacje o klasie'!D32)","v":""},{"$f":"'Wyniki z Sekcji 1'!O28","v":0},{"$f":"'Wyniki z Sekcji 1'!Z28","v":0},{"$f":"'Wyniki z Sekcji 2'!O28","v":0},{"$f":"'Wyniki z Sekcji 2'!U28","v":0},{"$f":"'Wyniki z Sekcji 3'!I28","v":0},0,0]
[{"$f":"IF(ISBLANK('Informacje o klasie'!C33),\"\",('Informacje o klasie'!B33))","v":""},{"$f":"IF(ISBLANK('Informacje o klasie'!C33),\"\",UPPER('Informacje o klasie'!C33)&\", \"&'Informacje o klasie'!D33)","v":""},{"$f":"'Wyniki z Sekcji 1'!O29","v":0},{"$f":"'Wyniki z Sekcji 1'!Z29","v":0},{"$f":"'Wyniki z Sekcji 2'!O29","v":0},{"$f":"'Wyniki z Sekcji 2'!U29","v":0},{"$f":"'Wyniki z Sekcji 3'!I29","v":0},0,0]
[{"$f":"IF(ISBLANK('Informacje o klasie'!C34),\"\",('Informacje o klasie'!B34))","v":""},{"$f":"IF(ISBLANK('Informacje o klasie'!C34),\"\",UPPER('Informacje o klasie'!C34)&\", \"&'Informacje o klasie'!D34)","v":""},{"$f":"'Wyniki z Sekcji 1'!O30","v":0},{"$f":"'Wyniki z Sekcji 1'!Z30","v":0},{"$f":"'Wyniki z Sekcji 2'!O30","v":0},{"$f":"'Wyniki z Sekcji 2'!U30","v":0},{"$f":"'Wyniki z Sekcji 3'!I30","v":0},0,0]
[{"$f":"IF(ISBLANK('Informacje o klasie'!C35),\"\",('Informacje o klasie'!B35))","v":""},{"$f":"IF(ISBLANK('Informacje o klasie'!C35),\"\",UPPER('Informacje o klasie'!C35)&\", \"&'Informacje o klasie'!D35)","v":""},{"$f":"'Wyniki z Sekcji 1'!O31","v":0},{"$f":"'Wyniki z Sekcji 1'!Z31","v":0},{"$f":"'Wyniki z Sekcji 2'!O31","v":0},{"$f":"'Wyniki z Sekcji 2'!U31","v":0},{"$f":"'Wyniki z Sekcji 3'!I31","v":0},0,0]
[{"$f":"IF(ISBLANK('Informacje o klasie'!C36),\"\",('Informacje o klasie'!B36))","v":""},{"$f":"IF(ISBLANK('Informacje o klasie'!C36),\"\",UPPER('Informacje o klasie'!C36)&\", \"&'Informacje o klasie'!D36)","v":""},{"$f":"'Wyniki z Sekcji 1'!O32","v":0},{"$f":"'Wyniki z Sekcji 1'!Z32","v":0},{"$f":"'Wyniki z Sekcji 2'!O32","v":0},{"$f":"'Wyniki z Sekcji 2'!U32","v":0},{"$f":"'Wyniki z Sekcji 3'!I32","v":0},0,0]
[{"$f":"IF(ISBLANK('Informacje o klasie'!C37),\"\",('Informacje o klasie'!B37))","v":""},{"$f":"IF(ISBLANK('Informacje o klasie'!C37),\"\",UPPER('Informacje o klasie'!C37)&\", \"&'Informacje o klasie'!D37)","v":""},{"$f":"'Wyniki z Sekcji 1'!O33","v":0},{"$f":"'Wyniki z Sekcji 1'!Z33","v":0},{"$f":"'Wyniki z Sekcji 2'!O33","v":0},{"$f":"'Wyniki z Sekcji 2'!U33","v":0},{"$f":"'Wyniki z Sekcji 3'!I33","v":0},0,0]
[{"$f":"IF(ISBLANK('Informacje o klasie'!C38),\"\",('Informacje o klasie'!B38))","v":""},{"$f":"IF(ISBLANK('Informacje o klasie'!C38),\"\",UPPER('Informacje o klasie'!C38)&\", \"&'Informacje o klasie'!D38)","v":""},{"$f":"'Wyniki z Sekcji 1'!O34","v":0},{"$f":"'Wyniki z Sekcji 1'!Z34","v":0},{"$f":"'Wyniki z Sekcji 2'!O34","v":0},{"$f":"'Wyniki z Sekcji 2'!U34","v":0},{"$f":"'Wyniki z Sekcji 3'!I34","v":0},0,0]
[{"$f":"IF(ISBLANK('Informacje o klasie'!C39),\"\",('Informacje o klasie'!B39))","v":""},{"$f":"IF(ISBLANK('Informacje o klasie'!C39),\"\",UPPER('Informacje o klasie'!C39)&\", \"&'Informacje o klasie'!D39)","v":""},{"$f":"'Wyniki z Sekcji 1'!O35","v":0},{"$f":"'Wyniki z Sekcji 1'!Z35","v":0},{"$f":"'Wyniki z Sekcji 2'!O35","v":0},{"$f":"'Wyniki z Sekcji 2'!U35","v":0},{"$f":"'Wyniki z Sekcji 3'!I35","v":0},0,0]
[{"$f":"IF(ISBLANK('Informacje o klasie'!C40),\"\",('Informacje o klasie'!B40))","v":""},{"$f":"IF(ISBLANK('Informacje o klasie'!C40),\"\",UPPER('Informacje o klasie'!C40)&\", \"&'Informacje o klasie'!D40)","v":""},{"$f":"'Wyniki z Sekcji 1'!O36","v":0},{"$f":"'Wyniki z Sekcji 1'!Z36","v":0},{"$f":"'Wyniki z Sekcji 2'!O36","v":0},{"$f":"'Wyniki z Sekcji 2'!U36","v":0},{"$f":"'Wyniki z Sekcji 3'!I36","v":0},0,0]
[{"$f":"IF(ISBLANK('Informacje o klasie'!C41),\"\",('Informacje o klasie'!B41))","v":""},{"$f":"IF(ISBLANK('Informacje o klasie'!C41),\"\",UPPER('Informacje o klasie'!C41)&\", \"&'Informacje o klasie'!D41)","v":""},{"$f":"'Wyniki z Sekcji 1'!O37","v":0},{"$f":"'Wyniki z Sekcji 1'!Z37","v":0},{"$f":"'Wyniki z Sekcji 2'!O37","v":0},{"$f":"'Wyniki z Sekcji 2'!U37","v":0},{"$f":"'Wyniki z Sekcji 3'!I37","v":0},0,0]
[{"$f":"IF(ISBLANK('Informacje o klasie'!C42),\"\",('Informacje o klasie'!B42))","v":""},{"$f":"IF(ISBLANK('Informacje o klasie'!C42),\"\",UPPER('Informacje o klasie'!C42)&\", \"&'Informacje o klasie'!D42)","v":""},{"$f":"'Wyniki z Sekcji 1'!O38","v":0},{"$f":"'Wyniki z Sekcji 1'!Z38","v":0},{"$f":"'Wyniki z Sekcji 2'!O38","v":0},{"$f":"'Wyniki z Sekcji 2'!U38","v":0},{"$f":"'Wyniki z Sekcji 3'!I38","v":0},0,0]
[{"$f":"IF(ISBLANK('Informacje o klasie'!C43),\"\",('Informacje o klasie'!B43))","v":""},{"$f":"IF(ISBLANK('Informacje o klasie'!C43),\"\",UPPER('Informacje o klasie'!C43)&\", \"&'Informacje o klasie'!D43)","v":""},{"$f":"'Wyniki z Sekcji 1'!O39","v":0},{"$f":"'Wyniki z Sekcji 1'!Z39","v":0},{"$f":"'Wyniki z Sekcji 2'!O39","v":0},{"$f":"'Wyniki z Sekcji 2'!U39","v":0},{"$f":"'Wyniki z Sekcji 3'!I39","v":0},0,0]
[{"$f":"IF(ISBLANK('Informacje o klasie'!C44),\"\",('Informacje o klasie'!B44))","v":""},{"$f":"IF(ISBLANK('Informacje o klasie'!C44),\"\",UPPER('Informacje o klasie'!C44)&\", \"&'Informacje o klasie'!D44)","v":""},{"$f":"'Wyniki z Sekcji 1'!O40","v":0},{"$f":"'Wyniki z Sekcji 1'!Z40","v":0},{"$f":"'Wyniki z Sekcji 2'!O40","v":0},{"$f":"'Wyniki z Sekcji 2'!U40","v":0},{"$f":"'Wyniki z Sekcji 3'!I40","v":0},0,0]
[{"$f":"IF(ISBLANK('Informacje o klasie'!C45),\"\",('Informacje o klasie'!B45))","v":""},{"$f":"IF(ISBLANK('Informacje o klasie'!C45),\"\",UPPER('Informacje o klasie'!C45)&\", \"&'Informacje o klasie'!D45)","v":""},{"$f":"'Wyniki z Sekcji 1'!O41","v":0},{"$f":"'Wyniki z Sekcji 1'!Z41","v":0},{"$f":"'Wyniki z Sekcji 2'!O41","v":0},{"$f":"'Wyniki z Sekcji 2'!U41","v":0},{"$f":"'Wyniki z Sekcji 3'!I41","v":0},0,0]
[{"$f":"A21","v":"Numer "},"Imię i nazwisko","ROZUMIENIE ZE SŁUCHU","ROZUMIENIE TEKSTÓW PISANYCH","ZNAJOMOŚĆ ŚRODKÓW I FUNKCJI JĘZYKOWYCH","WYPOWIEDŹ PISEMNA","WYPOWIEDŹ USTNA","SUMA","%"]
[{"$f":"IF(ISBLANK('Informacje o klasie'!C46),\"\",('Informacje o klasie'!B46))","v":""},{"$f":"IF(ISBLANK('Informacje o klasie'!C46),\"\",UPPER('Informacje o klasie'!C46)&\", \"&'Informacje o klasie'!D46)","v":""},{"$f":"'Wyniki z Sekcji 1'!O42","v":0},{"$f":"'Wyniki z Sekcji 1'!Z42","v":0},{"$f":"'Wyniki z Sekcji 2'!O42","v":0},{"$f":"'Wyniki z Sekcji 2'!U42","v":0},{"$f":"'Wyniki z Sekcji 3'!I42","v":0},0,0]
[{"$f":"IF(ISBLANK('Informacje o klasie'!C47),\"\",('Informacje o klasie'!B47))","v":""},{"$f":"IF(ISBLANK('Informacje o klasie'!C47),\"\",UPPER('Informacje o klasie'!C47)&\", \"&'Informacje o klasie'!D47)","v":""},{"$f":"'Wyniki z Sekcji 1'!O43","v":0},{"$f":"'Wyniki z Sekcji 1'!Z43","v":0},{"$f":"'Wyniki z Sekcji 2'!O43","v":0},{"$f":"'Wyniki z Sekcji 2'!U43","v":0},{"$f":"'Wyniki z Sekcji 3'!I43","v":0},0,0]
[{"$f":"IF(ISBLANK('Informacje o klasie'!C48),\"\",('Informacje o klasie'!B48))","v":""},{"$f":"IF(ISBLANK('Informacje o klasie'!C48),\"\",UPPER('Informacje o klasie'!C48)&\", \"&'Informacje o klasie'!D48)","v":""},{"$f":"'Wyniki z Sekcji 1'!O44","v":0},{"$f":"'Wyniki z Sekcji 1'!Z44","v":0},{"$f":"'Wyniki z Sekcji 2'!O44","v":0},{"$f":"'Wyniki z Sekcji 2'!U44","v":0},{"$f":"'Wyniki z Sekcji 3'!I44","v":0},0,0]
[{"$f":"IF(ISBLANK('Informacje o klasie'!C49),\"\",('Informacje o klasie'!B49))","v":""},{"$f":"IF(ISBLANK('Informacje o klasie'!C49),\"\",UPPER('Informacje o klasie'!C49)&\", \"&'Informacje o klasie'!D49)","v":""},{"$f":"'Wyniki z Sekcji 1'!O45","v":0},{"$f":"'Wyniki z Sekcji 1'!Z45","v":0},{"$f":"'Wyniki z Sekcji 2'!O45","v":0},{"$f":"'Wyniki z Sekcji 2'!U45","v":0},{"$f":"'Wyniki z Sekcji 3'!I45","v":0},0,0]
[{"$f":"IF(ISBLANK('Informacje o klasie'!C50),\"\",('Informacje o klasie'!B50))","v":""},{"$f":"IF(ISBLANK('Informacje o klasie'!C50),\"\",UPPER('Informacje o klasie'!C50)&\", \"&'Informacje o klasie'!D50)","v":""},{"$f":"'Wyniki z Sekcji 1'!O46","v":0},{"$f":"'Wyniki z Sekcji 1'!Z46","v":0},{"$f":"'Wyniki z Sekcji 2'!O46","v":0},{"$f":"'Wyniki z Sekcji 2'!U46","v":0},{"$f":"'Wyniki z Sekcji 3'!I46","v":0},0,0]
[{"$f":"IF(ISBLANK('Informacje o klasie'!C51),\"\",('Informacje o klasie'!B51))","v":""},{"$f":"IF(ISBLANK('Informacje o klasie'!C51),\"\",UPPER('Informacje o klasie'!C51)&\", \"&'Informacje o klasie'!D51)","v":""},{"$f":"'Wyniki z Sekcji 1'!O47","v":0},{"$f":"'Wyniki z Sekcji 1'!Z47","v":0},{"$f":"'Wyniki z Sekcji 2'!O47","v":0},{"$f":"'Wyniki z Sekcji 2'!U47","v":0},{"$f":"'Wyniki z Sekcji 3'!I47","v":0},0,0]
[{"$f":"IF(ISBLANK('Informacje o klasie'!C52),\"\",('Informacje o klasie'!B52))","v":""},{"$f":"IF(ISBLANK('Informacje o klasie'!C52),\"\",UPPER('Informacje o klasie'!C52)&\", \"&'Informacje o klasie'!D52)","v":""},{"$f":"'Wyniki z Sekcji 1'!O48","v":0},{"$f":"'Wyniki z Sekcji 1'!Z48","v":0},{"$f":"'Wyniki z Sekcji 2'!O48","v":0},{"$f":"'Wyniki z Sekcji 2'!U48","v":0},{"$f":"'Wyniki z Sekcji 3'!I48","v":0},0,0]
[{"$f":"IF(ISBLANK('Informacje o klasie'!C53),\"\",('Informacje o klasie'!B53))","v":""},{"$f":"IF(ISBLANK('Informacje o klasie'!C53),\"\",UPPER('Informacje o klasie'!C53)&\", \"&'Informacje o klasie'!D53)","v":""},{"$f":"'Wyniki z Sekcji 1'!O49","v":0},{"$f":"'Wyniki z Sekcji 1'!Z49","v":0},{"$f":"'Wyniki z Sekcji 2'!O49","v":0},{"$f":"'Wyniki z Sekcji 2'!U49","v":0},{"$f":"'Wyniki z Sekcji 3'!I49","v":0},0,0]
[{"$f":"IF(ISBLANK('Informacje o klasie'!C54),\"\",('Informacje o klasie'!B54))","v":""},{"$f":"IF(ISBLANK('Informacje o klasie'!C54),\"\",UPPER('Informacje o klasie'!C54)&\", \"&'Informacje o klasie'!D54)","v":""},{"$f":"'Wyniki z Sekcji 1'!O50","v":0},{"$f":"'Wyniki z Sekcji 1'!Z50","v":0},{"$f":"'Wyniki z Sekcji 2'!O50","v":0},{"$f":"'Wyniki z Sekcji 2'!U50","v":0},{"$f":"'Wyniki z Sekcji 3'!I50","v":0},0,0]
[{"$f":"IF(ISBLANK('Informacje o klasie'!C55),\"\",('Informacje o klasie'!B55))","v":""},{"$f":"IF(ISBLANK('Informacje o klasie'!C55),\"\",UPPER('Informacje o klasie'!C55)&\", \"&'Informacje o klasie'!D55)","v":""},{"$f":"'Wyniki z Sekcji 1'!O51","v":0},{"$f":"'Wyniki z Sekcji 1'!Z51","v":0},{"$f":"'Wyniki z Sekcji 2'!O51","v":0},{"$f":"'Wyniki z Sekcji 2'!U51","v":0},{"$f":"'Wyniki z Sekcji 3'!I51","v":0},0,0]
[{"$f":"IF(ISBLANK('Informacje o klasie'!C56),\"\",('Informacje o klasie'!B56))","v":""},{"$f":"IF(ISBLANK('Informacje o klasie'!C56),\"\",UPPER('Informacje o klasie'!C56)&\", \"&'Informacje o klasie'!D56)","v":""},{"$f":"'Wyniki z Sekcji 1'!O52","v":0},{"$f":"'Wyniki z Sekcji 1'!Z52","v":0},{"$f":"'Wyniki z Sekcji 2'!O52","v":0},{"$f":"'Wyniki z Sekcji 2'!U52","v":0},{"$f":"'Wyniki z Sekcji 3'!I52","v":0},0,0]
[{"$f":"IF(ISBLANK('Informacje o klasie'!C57),\"\",('Informacje o klasie'!B57))","v":""},{"$f":"IF(ISBLANK('Informacje o klasie'!C57),\"\",UPPER('Informacje o klasie'!C57)&\", \"&'Informacje o klasie'!D57)","v":""},{"$f":"'Wyniki z Sekcji 1'!O53","v":0},{"$f":"'Wyniki z Sekcji 1'!Z53","v":0},{"$f":"'Wyniki z Sekcji 2'!O53","v":0},{"$f":"'Wyniki z Sekcji 2'!U53","v":0},{"$f":"'Wyniki z Sekcji 3'!I53","v":0},0,0]
[{"$f":"IF(ISBLANK('Informacje o klasie'!C58),\"\",('Informacje o klasie'!B58))","v":""},{"$f":"IF(ISBLANK('Informacje o klasie'!C58),\"\",UPPER('Informacje o klasie'!C58)&\", \"&'Informacje o klasie'!D58)","v":""},{"$f":"'Wyniki z Sekcji 1'!O54","v":0},{"$f":"'Wyniki z Sekcji 1'!Z54","v":0},{"$f":"'Wyniki z Sekcji 2'!O54","v":0},{"$f":"'Wyniki z Sekcji 2'!U54","v":0},{"$f":"'Wyniki z Sekcji 3'!I54","v":0},0,0]
[{"$f":"IF(ISBLANK('Informacje o klasie'!C59),\"\",('Informacje o klasie'!B59))","v":""},{"$f":"IF(ISBLANK('Informacje o klasie'!C59),\"\",UPPER('Informacje o klasie'!C59)&\", \"&'Informacje o klasie'!D59)","v":""},{"$f":"'Wyniki z Sekcji 1'!O55","v":0},{"$f":"'Wyniki z Sekcji 1'!Z55","v":0},{"$f":"'Wyniki z Sekcji 2'!O55","v":0},{"$f":"'Wyniki z Sekcji 2'!U55","v":0},{"$f":"'Wyniki z Sekcji 3'!I55","v":0},0,0]
[{"$f":"IF(ISBLANK('Informacje o klasie'!C60),\"\",('Informacje o klasie'!B60))","v":""},{"$f":"IF(ISBLANK('Informacje o klasie'!C60),\"\",UPPER('Informacje o klasie'!C60)&\", \"&'Informacje o klasie'!D60)","v":""},{"$f":"'Wyniki z Sekcji 1'!O56","v":0},{"$f":"'Wyniki z Sekcji 1'!Z56","v":0},{"$f":"'Wyniki z Sekcji 2'!O56","v":0},{"$f":"'Wyniki z Sekcji 2'!U56","v":0},{"$f":"'Wyniki z Sekcji 3'!I56","v":0},0,0]
[{"$f":"IF(ISBLANK('Informacje o klasie'!C61),\"\",('Informacje o klasie'!B61))","v":""},{"$f":"IF(ISBLANK('Informacje o klasie'!C61),\"\",UPPER('Informacje o klasie'!C61)&\", \"&'Informacje o klasie'!D61)","v":""},{"$f":"'Wyniki z Sekcji 1'!O57","v":0},{"$f":"'Wyniki z Sekcji 1'!Z57","v":0},{"$f":"'Wyniki z Sekcji 2'!O57","v":0},{"$f":"'Wyniki z Sekcji 2'!U57","v":0},{"$f":"'Wyniki z Sekcji 3'!I57","v":0},0,0]
[{"$f":"IF(ISBLANK('Informacje o klasie'!C62),\"\",('Informacje o klasie'!B62))","v":""},{"$f":"IF(ISBLANK('Informacje o klasie'!C62),\"\",UPPER('Informacje o klasie'!C62)&\", \"&'Informacje o klasie'!D62)","v":""},{"$f":"'Wyniki z Sekcji 1'!O58","v":0},{"$f":"'Wyniki z Sekcji 1'!Z58","v":0},{"$f":"'Wyniki z Sekcji 2'!O58","v":0},{"$f":"'Wyniki z Sekcji 2'!U58","v":0},{"$f":"'Wyniki z Sekcji 3'!I58","v":0},0,0]
[{"$f":"IF(ISBLANK('Informacje o klasie'!C63),\"\",('Informacje o klasie'!B63))","v":""},{"$f":"IF(ISBLANK('Informacje o klasie'!C63),\"\",UPPER('Informacje o klasie'!C63)&\", \"&'Informacje o klasie'!D63)","v":""},{"$f":"'Wyniki z Sekcji 1'!O59","v":0},{"$f":"'Wyniki z Sekcji 1'!Z59","v":0},{"$f":"'Wyniki z Sekcji 2'!O59","v":0},{"$f":"'Wyniki z Sekcji 2'!U59","v":0},{"$f":"'Wyniki z Sekcji 3'!I59","v":0},0,0]
[{"$f":"IF(ISBLANK('Informacje o klasie'!C64),\"\",('Informacje o klasie'!B64))","v":""},{"$f":"IF(ISBLANK('Informacje o klasie'!C64),\"\",UPPER('Informacje o klasie'!C64)&\", \"&'Informacje o klasie'!D64)","v":""},{"$f":"'Wyniki z Sekcji 1'!O60","v":0},{"$f":"'Wyniki z Sekcji 1'!Z60","v":0},{"$f":"'Wyniki z Sekcji 2'!O60","v":0},{"$f":"'Wyniki z Sekcji 2'!U60","v":0},{"$f":"'Wyniki z Sekcji 3'!I60","v":0},0,0]
[{"$f":"IF(ISBLANK('Informacje o klasie'!C65),\"\",('Informacje o klasie'!B65))","v":""},{"$f":"IF(ISBLANK('Informacje o klasie'!C65),\"\",UPPER('Informacje o klasie'!C65)&\", \"&'Informacje o klasie'!D65)","v":""},{"$f":"'Wyniki z Sekcji 1'!O61","v":0},{"$f":"'Wyniki z Sekcji 1'!Z61","v":0},{"$f":"'Wyniki z Sekcji 2'!O61","v":0},{"$f":"'Wyniki z Sekcji 2'!U61","v":0},{"$f":"'Wyniki z Sekcji 3'!I61","v":0},0,0]
[{"$f":"IF(ISBLANK('Informacje o klasie'!C66),\"\",('Informacje o klasie'!B66))","v":""},{"$f":"IF(ISBLANK('Informacje o klasie'!C66),\"\",UPPER('Informacje o klasie'!C66)&\", \"&'Informacje o klasie'!D66)","v":""},{"$f":"'Wyniki z Sekcji 1'!O62","v":0},{"$f":"'Wyniki z Sekcji 1'!Z62","v":0},{"$f":"'Wyniki z Sekcji 2'!O62","v":0},{"$f":"'Wyniki z Sekcji 2'!U62","v":0},{"$f":"'Wyniki z Sekcji 3'!I62","v":0},0,0]
[{"$f":"IF(ISBLANK('Informacje o klasie'!C67),\"\",('Informacje o klasie'!B67))","v":""},{"$f":"IF(ISBLANK('Informacje o klasie'!C67),\"\",UPPER('Informacje o klasie'!C67)&\", \"&'Informacje o klasie'!D67)","v":""},{"$f":"'Wyniki z Sekcji 1'!O63","v":0},{"$f":"'Wyniki z Sekcji 1'!Z63","v":0},{"$f":"'Wyniki z Sekcji 2'!O63","v":0},{"$f":"'Wyniki z Sekcji 2'!U63","v":0},{"$f":"'Wyniki z Sekcji 3'!I63","v":0},0,0]
[{"$f":"IF(ISBLANK('Informacje o klasie'!C68),\"\",('Informacje o klasie'!B68))","v":""},{"$f":"IF(ISBLANK('Informacje o klasie'!C68),\"\",UPPER('Informacje o klasie'!C68)&\", \"&'Informacje o klasie'!D68)","v":""},{"$f":"'Wyniki z Sekcji 1'!O64","v":0},{"$f":"'Wyniki z Sekcji 1'!Z64","v":0},{"$f":"'Wyniki z Sekcji 2'!O64","v":0},{"$f":"'Wyniki z Sekcji 2'!U64","v":0},{"$f":"'Wyniki z Sekcji 3'!I64","v":0},0,0]
[{"$f":"IF(ISBLANK('Informacje o klasie'!C69),\"\",('Informacje o klasie'!B69))","v":""},{"$f":"IF(ISBLANK('Informacje o klasie'!C69),\"\",UPPER('Informacje o klasie'!C69)&\", \"&'Informacje o klasie'!D69)","v":""},{"$f":"'Wyniki z Sekcji 1'!O65","v":0},{"$f":"'Wyniki z Sekcji 1'!Z65","v":0},{"$f":"'Wyniki z Sekcji 2'!O65","v":0},{"$f":"'Wyniki z Sekcji 2'!U65","v":0},{"$f":"'Wyniki z Sekcji 3'!I65","v":0},0,0]
[{"$f":"IF(ISBLANK('Informacje o klasie'!C70),\"\",('Informacje o klasie'!B70))","v":""},{"$f":"IF(ISBLANK('Informacje o klasie'!C70),\"\",UPPER('Informacje o klasie'!C70)&\", \"&'Informacje o klasie'!D70)","v":""},{"$f":"'Wyniki z Sekcji 1'!O66","v":0},{"$f":"'Wyniki z Sekcji 1'!Z66","v":0},{"$f":"'Wyniki z Sekcji 2'!O66","v":0},{"$f":"'Wyniki z Sekcji 2'!U66","v":0},{"$f":"'Wyniki z Sekcji 3'!I66","v":0},0,0]
[{"$f":"IF(ISBLANK('Informacje o klasie'!C71),\"\",('Informacje o klasie'!B71))","v":""},{"$f":"IF(ISBLANK('Informacje o klasie'!C71),\"\",UPPER('Informacje o klasie'!C71)&\", \"&'Informacje o klasie'!D71)","v":""},{"$f":"'Wyniki z Sekcji 1'!O67","v":0},{"$f":"'Wyniki z Sekcji 1'!Z67","v":0},{"$f":"'Wyniki z Sekcji 2'!O67","v":0},{"$f":"'Wyniki z Sekcji 2'!U67","v":0},{"$f":"'Wyniki z Sekcji 3'!I67","v":0},0,0]
[{"$f":"IF(ISBLANK('Informacje o klasie'!C72),\"\",('Informacje o klasie'!B72))","v":""},{"$f":"IF(ISBLANK('Informacje o klasie'!C72),\"\",UPPER('Informacje o klasie'!C72)&\", \"&'Informacje o klasie'!D72)","v":""},{"$f":"'Wyniki z Sekcji 1'!O68","v":0},{"$f":"'Wyniki z Sekcji 1'!Z68","v":0},{"$f":"'Wyniki z Sekcji 2'!O68","v":0},{"$f":"'Wyniki z Sekcji 2'!U68","v":0},{"$f":"'Wyniki z Sekcji 3'!I68","v":0},0,0]
[{"$f":"IF(ISBLANK('Informacje o klasie'!C73),\"\",('Informacje o klasie'!B73))","v":""},{"$f":"IF(ISBLANK('Informacje o klasie'!C73),\"\",UPPER('Informacje o klasie'!C73)&\", \"&'Informacje o klasie'!D73)","v":""},{"$f":"'Wyniki z Sekcji 1'!O69","v":0},{"$f":"'Wyniki z Sekcji 1'!Z69","v":0},{"$f":"'Wyniki z Sekcji 2'!O69","v":0},{"$f":"'Wyniki z Sekcji 2'!U69","v":0},{"$f":"'Wyniki z Sekcji 3'!I69","v":0},0,0]
[{"$f":"IF(ISBLANK('Informacje o klasie'!C74),\"\",('Informacje o klasie'!B74))","v":""},{"$f":"IF(ISBLANK('Informacje o klasie'!C74),\"\",UPPER('Informacje o klasie'!C74)&\", \"&'Informacje o klasie'!D74)","v":""},{"$f":"'Wyniki z Sekcji 1'!O70","v":0},{"$f":"'Wyniki z Sekcji 1'!Z70","v":0},{"$f":"'Wyniki z Sekcji 2'!O70","v":0},{"$f":"'Wyniki z Sekcji 2'!U70","v":0},{"$f":"'Wyniki z Sekcji 3'!I70","v":0},0,0]
[{"$f":"IF(ISBLANK('Informacje o klasie'!C75),\"\",('Informacje o klasie'!B75))","v":""},{"$f":"IF(ISBLANK('Informacje o klasie'!C75),\"\",UPPER('Informacje o klasie'!C75)&\", \"&'Informacje o klasie'!D75)","v":""},{"$f":"'Wyniki z Sekcji 1'!O71","v":0},{"$f":"'Wyniki z Sekcji 1'!Z71","v":0},{"$f":"'Wyniki z Sekcji 2'!O71","v":0},{"$f":"'Wyniki z Sekcji 2'!U71","v":0},{"$f":"'Wyniki z Sekcji 3'!I71","v":0},0,0]
[{"$f":"IF(ISBLANK('Informacje o klasie'!C76),\"\",('Informacje o klasie'!B76))","v":""},{"$f":"IF(ISBLANK('Informacje o klasie'!C76),\"\",UPPER('Informacje o klasie'!C76)&\", \"&'Informacje o klasie'!D76)","v":""},{"$f":"'Wyniki z Sekcji 1'!O72","v":0},{"$f":"'Wyniki z Sekcji 1'!Z72","v":0},{"$f":"'Wyniki z Sekcji 2'!O72","v":0},{"$f":"'Wyniki z Sekcji 2'!U72","v":0},{"$f":"'Wyniki z Sekcji 3'!I72","v":0},0,0]
[{"$f":"A54","v":"Numer "},"Imię i nazwisko","ROZUMIENIE ZE SŁUCHU","ROZUMIENIE TEKSTÓW PISANYCH","ZNAJOMOŚĆ ŚRODKÓW I FUNKCJI JĘZYKOWYCH","WYPOWIEDŹ PISEMNA","WYPOWIEDŹ USTNA","SUMA","%"]
[{"$f":"IF(ISBLANK('Informacje o klasie'!C78),\"\",('Informacje o klasie'!B78))","v":""},{"$f":"IF(ISBLANK('Informacje o klasie'!C78),\"\",UPPER('Informacje o klasie'!C78)&\", \"&'Informacje o klasie'!D78)","v":""},{"$f":"'Wyniki z Sekcji 1'!O74","v":0},{"$f":"'Wyniki z Sekcji 1'!Z74","v":0},{"$f":"'Wyniki z Sekcji 2'!O74","v":0},{"$f":"'Wyniki z Sekcji 2'!U74","v":0},{"$f":"'Wyniki z Sekcji 3'!I74","v":0},0,0]
[{"$f":"IF(ISBLANK('Informacje o klasie'!C79),\"\",('Informacje o klasie'!B79))","v":""},{"$f":"IF(ISBLANK('Informacje o klasie'!C79),\"\",UPPER('Informacje o klasie'!C79)&\", \"&'Informacje o klasie'!D79)","v":""},{"$f":"'Wyniki z Sekcji 1'!O75","v":0},{"$f":"'Wyniki z Sekcji 1'!Z75","v":0},{"$f":"'Wyniki z Sekcji 2'!O75","v":0},{"$f":"'Wyniki z Sekcji 2'!U75","v":0},{"$f":"'Wyniki z Sekcji 3'!I75","v":0},{"$f":"SUM(C88:G88)","v":0},{"$f":"H88/50","v":0}]
[{"$f":"IF(ISBLANK('Informacje o klasie'!C80),\"\",('Informacje o klasie'!B80))","v":""},{"$f":"IF(ISBLANK('Informacje o klasie'!C80),\"\",UPPER('Informacje o klasie'!C80)&\", \"&'Informacje o klasie'!D80)","v":""},{"$f":"'Wyniki z Sekcji 1'!O76","v":0},{"$f":"'Wyniki z Sekcji 1'!Z76","v":0},{"$f":"'Wyniki z Sekcji 2'!O76","v":0},{"$f":"'Wyniki z Sekcji 2'!U76","v":0},{"$f":"'Wyniki z Sekcji 3'!I76","v":0},0,0]
[{"$f":"IF(ISBLANK('Informacje o klasie'!C81),\"\",('Informacje o klasie'!B81))","v":""},{"$f":"IF(ISBLANK('Informacje o klasie'!C81),\"\",UPPER('Informacje o klasie'!C81)&\", \"&'Informacje o klasie'!D81)","v":""},{"$f":"'Wyniki z Sekcji 1'!O77","v":0},{"$f":"'Wyniki z Sekcji 1'!Z77","v":0},{"$f":"'Wyniki z Sekcji 2'!O77","v":0},{"$f":"'Wyniki z Sekcji 2'!U77","v":0},{"$f":"'Wyniki z Sekcji 3'!I77","v":0},0,0]
[{"$f":"IF(ISBLANK('Informacje o klasie'!C82),\"\",('Informacje o klasie'!B82))","v":""},{"$f":"IF(ISBLANK('Informacje o klasie'!C82),\"\",UPPER('Informacje o klasie'!C82)&\", \"&'Informacje o klasie'!D82)","v":""},{"$f":"'Wyniki z Sekcji 1'!O78","v":0},{"$f":"'Wyniki z Sekcji 1'!Z78","v":0},{"$f":"'Wyniki z Sekcji 2'!O78","v":0},{"$f":"'Wyniki z Sekcji 2'!U78","v":0},{"$f":"'Wyniki z Sekcji 3'!I78","v":0},0,0]
[{"$f":"IF(ISBLANK('Informacje o klasie'!C83),\"\",('Informacje o klasie'!B83))","v":""},{"$f":"IF(ISBLANK('Informacje o klasie'!C83),\"\",UPPER('Informacje o klasie'!C83)&\", \"&'Informacje o klasie'!D83)","v":""},{"$f":"'Wyniki z Sekcji 1'!O79","v":0},{"$f":"'Wyniki z Sekcji 1'!Z79","v":0},{"$f":"'Wyniki z Sekcji 2'!O79","v":0},{"$f":"'Wyniki z Sekcji 2'!U79","v":0},{"$f":"'Wyniki z Sekcji 3'!I79","v":0},0,0]
[{"$f":"IF(ISBLANK('Informacje o klasie'!C84),\"\",('Informacje o klasie'!B84))","v":""},{"$f":"IF(ISBLANK('Informacje o klasie'!C84),\"\",UPPER('Informacje o klasie'!C84)&\", \"&'Informacje o klasie'!D84)","v":""},{"$f":"'Wyniki z Sekcji 1'!O80","v":0},{"$f":"'Wyniki z Sekcji 1'!Z80","v":0},{"$f":"'Wyniki z Sekcji 2'!O80","v":0},{"$f":"'Wyniki z Sekcji 2'!U80","v":0},{"$f":"'Wyniki z Sekcji 3'!I80","v":0},0,0]
[{"$f":"IF(ISBLANK('Informacje o klasie'!C85),\"\",('Informacje o klasie'!B85))","v":""},{"$f":"IF(ISBLANK('Informacje o klasie'!C85),\"\",UPPER('Informacje o klasie'!C85)&\", \"&'Informacje o klasie'!D85)","v":""},{"$f":"'Wyniki z Sekcji 1'!O81","v":0},{"$f":"'Wyniki z Sekcji 1'!Z81","v":0},{"$f":"'Wyniki z Sekcji 2'!O81","v":0},{"$f":"'Wyniki z Sekcji 2'!U81","v":0},{"$f":"'Wyniki z Sekcji 3'!I81","v":0},0,0]
[{"$f":"IF(ISBLANK('Informacje o klasie'!C86),\"\",('Informacje o klasie'!B86))","v":""},{"$f":"IF(ISBLANK('Informacje o klasie'!C86),\"\",UPPER('Informacje o klasie'!C86)&\", \"&'Informacje o klasie'!D86)","v":""},{"$f":"'Wyniki z Sekcji 1'!O82","v":0},{"$f":"'Wyniki z Sekcji 1'!Z82","v":0},{"$f":"'Wyniki z Sekcji 2'!O82","v":0},{"$f":"'Wyniki z Sekcji 2'!U82","v":0},{"$f":"'Wyniki z Sekcji 3'!I82","v":0},0,0]
[{"$f":"IF(ISBLANK('Informacje o klasie'!C87),\"\",('Informacje o klasie'!B87))","v":""},{"$f":"IF(ISBLANK('Informacje o klasie'!C87),\"\",UPPER('Informacje o klasie'!C87)&\", \"&'Informacje o klasie'!D87)","v":""},{"$f":"'Wyniki z Sekcji 1'!O83","v":0},{"$f":"'Wyniki z Sekcji 1'!Z83","v":0},{"$f":"'Wyniki z Sekcji 2'!O83","v":0},{"$f":"'Wyniki z Sekcji 2'!U83","v":0},{"$f":"'Wyniki z Sekcji 3'!I83","v":0},0,0]
[{"$f":"IF(ISBLANK('Informacje o klasie'!C88),\"\",('Informacje o klasie'!B88))","v":""},{"$f":"IF(ISBLANK('Informacje o klasie'!C88),\"\",UPPER('Informacje o klasie'!C88)&\", \"&'Informacje o klasie'!D88)","v":""},{"$f":"'Wyniki z Sekcji 1'!O84","v":0},{"$f":"'Wyniki z Sekcji 1'!Z84","v":0},{"$f":"'Wyniki z Sekcji 2'!O84","v":0},{"$f":"'Wyniki z Sekcji 2'!U84","v":0},{"$f":"'Wyniki z Sekcji 3'!I84","v":0},0,0]
[{"$f":"IF(ISBLANK('Informacje o klasie'!C89),\"\",('Informacje o klasie'!B89))","v":""},{"$f":"IF(ISBLANK('Informacje o klasie'!C89),\"\",UPPER('Informacje o klasie'!C89)&\", \"&'Informacje o klasie'!D89)","v":""},{"$f":"'Wyniki z Sekcji 1'!O85","v":0},{"$f":"'Wyniki z Sekcji 1'!Z85","v":0},{"$f":"'Wyniki z Sekcji 2'!O85","v":0},{"$f":"'Wyniki z Sekcji 2'!U85","v":0},{"$f":"'Wyniki z Sekcji 3'!I85","v":0},0,0]
[{"$f":"IF(ISBLANK('Informacje o klasie'!C90),\"\",('Informacje o klasie'!B90))","v":""},{"$f":"IF(ISBLANK('Informacje o klasie'!C90),\"\",UPPER('Informacje o klasie'!C90)&\", \"&'Informacje o klasie'!D90)","v":""},{"$f":"'Wyniki z Sekcji 1'!O86","v":0},{"$f":"'Wyniki z Sekcji 1'!Z86","v":0},{"$f":"'Wyniki z Sekcji 2'!O86","v":0},{"$f":"'Wyniki z Sekcji 2'!U86","v":0},{"$f":"'Wyniki z Sekcji 3'!I86","v":0},0,0]
[{"$f":"IF(ISBLANK('Informacje o klasie'!C91),\"\",('Informacje o klasie'!B91))","v":""},{"$f":"IF(ISBLANK('Informacje o klasie'!C91),\"\",UPPER('Informacje o klasie'!C91)&\", \"&'Informacje o klasie'!D91)","v":""},{"$f":"'Wyniki z Sekcji 1'!O87","v":0},{"$f":"'Wyniki z Sekcji 1'!Z87","v":0},{"$f":"'Wyniki z Sekcji 2'!O87","v":0},{"$f":"'Wyniki z Sekcji 2'!U87","v":0},{"$f":"'Wyniki z Sekcji 3'!I87","v":0},0,0]
[{"$f":"IF(ISBLANK('Informacje o klasie'!C92),\"\",('Informacje o klasie'!B92))","v":""},{"$f":"IF(ISBLANK('Informacje o klasie'!C92),\"\",UPPER('Informacje o klasie'!C92)&\", \"&'Informacje o klasie'!D92)","v":""},{"$f":"'Wyniki z Sekcji 1'!O88","v":0},{"$f":"'Wyniki z Sekcji 1'!Z88","v":0},{"$f":"'Wyniki z Sekcji 2'!O88","v":0},{"$f":"'Wyniki z Sekcji 2'!U88","v":0},{"$f":"'Wyniki z Sekcji 3'!I88","v":0},0,0]
[{"$f":"IF(ISBLANK('Informacje o klasie'!C93),\"\",('Informacje o klasie'!B93))","v":""},{"$f":"IF(ISBLANK('Informacje o klasie'!C93),\"\",UPPER('Informacje o klasie'!C93)&\", \"&'Informacje o klasie'!D93)","v":""},{"$f":"'Wyniki z Sekcji 1'!O89","v":0},{"$f":"'Wyniki z Sekcji 1'!Z89","v":0},{"$f":"'Wyniki z Sekcji 2'!O89","v":0},{"$f":"'Wyniki z Sekcji 2'!U89","v":0},{"$f":"'Wyniki z Sekcji 3'!I89","v":0},0,0]
[{"$f":"IF(ISBLANK('Informacje o klasie'!C94),\"\",('Informacje o klasie'!B94))","v":""},{"$f":"IF(ISBLANK('Informacje o klasie'!C94),\"\",UPPER('Informacje o klasie'!C94)&\", \"&'Informacje o klasie'!D94)","v":""},{"$f":"'Wyniki z Sekcji 1'!O90","v":0},{"$f":"'Wyniki z Sekcji 1'!Z90","v":0},{"$f":"'Wyniki z Sekcji 2'!O90","v":0},{"$f":"'Wyniki z Sekcji 2'!U90","v":0},{"$f":"'Wyniki z Sekcji 3'!I90","v":0},0,0]
[{"$f":"IF(ISBLANK('Informacje o klasie'!C95),\"\",('Informacje o klasie'!B95))","v":""},{"$f":"IF(ISBLANK('Informacje o klasie'!C95),\"\",UPPER('Informacje o klasie'!C95)&\", \"&'Informacje o klasie'!D95)","v":""},{"$f":"'Wyniki z Sekcji 1'!O91","v":0},{"$f":"'Wyniki z Sekcji 1'!Z91","v":0},{"$f":"'Wyniki z Sekcji 2'!O91","v":0},{"$f":"'Wyniki z Sekcji 2'!U91","v":0},{"$f":"'Wyniki z Sekcji 3'!I91","v":0},0,0]
[{"$f":"IF(ISBLANK('Informacje o klasie'!C96),\"\",('Informacje o klasie'!B96))","v":""},{"$f":"IF(ISBLANK('Informacje o klasie'!C96),\"\",UPPER('Informacje o klasie'!C96)&\", \"&'Informacje o klasie'!D96)","v":""},{"$f":"'Wyniki z Sekcji 1'!O92","v":0},{"$f":"'Wyniki z Sekcji 1'!Z92","v":0},{"$f":"'Wyniki z Sekcji 2'!O92","v":0},{"$f":"'Wyniki z Sekcji 2'!U92","v":0},{"$f":"'Wyniki z Sekcji 3'!I92","v":0},0,0]
[{"$f":"IF(ISBLANK('Informacje o klasie'!C97),\"\",('Informacje o klasie'!B97))","v":""},{"$f":"IF(ISBLANK('Informacje o klasie'!C97),\"\",UPPER('Informacje o klasie'!C97)&\", \"&'Informacje o klasie'!D97)","v":""},{"$f":"'Wyniki z Sekcji 1'!O93","v":0},{"$f":"'Wyniki z Sekcji 1'!Z93","v":0},{"$f":"'Wyniki z Sekcji 2'!O93","v":0},{"$f":"'Wyniki z Sekcji 2'!U93","v":0},{"$f":"'Wyniki z Sekcji 3'!I93","v":0},0,0]
[{"$f":"IF(ISBLANK('Informacje o klasie'!C98),\"\",('Informacje o klasie'!B98))","v":""},{"$f":"IF(ISBLANK('Informacje o klasie'!C98),\"\",UPPER('Informacje o klasie'!C98)&\", \"&'Informacje o klasie'!D98)","v":""},{"$f":"'Wyniki z Sekcji 1'!O94","v":0},{"$f":"'Wyniki z Sekcji 1'!Z94","v":0},{"$f":"'Wyniki z Sekcji 2'!O94","v":0},{"$f":"'Wyniki z Sekcji 2'!U94","v":0},{"$f":"'Wyniki z Sekcji 3'!I94","v":0},0,0]
[{"$f":"IF(ISBLANK('Informacje o klasie'!C99),\"\",('Informacje o klasie'!B99))","v":""},{"$f":"IF(ISBLANK('Informacje o klasie'!C99),\"\",UPPER('Informacje o klasie'!C99)&\", \"&'Informacje o klasie'!D99)","v":""},{"$f":"'Wyniki z Sekcji 1'!O95","v":0},{"$f":"'Wyniki z Sekcji 1'!Z95","v":0},{"$f":"'Wyniki z Sekcji 2'!O95","v":0},{"$f":"'Wyniki z Sekcji 2'!U95","v":0},{"$f":"'Wyniki z Sekcji 3'!I95","v":0},0,0]
[{"$f":"IF(ISBLANK('Informacje o klasie'!C100),\"\",('Informacje o klasie'!B100))","v":""},{"$f":"IF(ISBLANK('Informacje o klasie'!C100),\"\",UPPER('Informacje o klasie'!C100)&\", \"&'Informacje o klasie'!D100)","v":""},{"$f":"'Wyniki z Sekcji 1'!O96","v":0},{"$f":"'Wyniki z Sekcji 1'!Z96","v":0},{"$f":"'Wyniki z Sekcji 2'!O96","v":0},{"$f":"'Wyniki z Sekcji 2'!U96","v":0},{"$f":"'Wyniki z Sekcji 3'!I96","v":0},0,0]
[{"$f":"IF(ISBLANK('Informacje o klasie'!C101),\"\",('Informacje o klasie'!B101))","v":""},{"$f":"IF(ISBLANK('Informacje o klasie'!C101),\"\",UPPER('Informacje o klasie'!C101)&\", \"&'Informacje o klasie'!D101)","v":""},{"$f":"'Wyniki z Sekcji 1'!O97","v":0},{"$f":"'Wyniki z Sekcji 1'!Z97","v":0},{"$f":"'Wyniki z Sekcji 2'!O97","v":0},{"$f":"'Wyniki z Sekcji 2'!U97","v":0},{"$f":"'Wyniki z Sekcji 3'!I97","v":0},0,0]
[{"$f":"IF(ISBLANK('Informacje o klasie'!C102),\"\",('Informacje o klasie'!B102))","v":""},{"$f":"IF(ISBLANK('Informacje o klasie'!C102),\"\",UPPER('Informacje o klasie'!C102)&\", \"&'Informacje o klasie'!D102)","v":""},{"$f":"'Wyniki z Sekcji 1'!O98","v":0},{"$f":"'Wyniki z Sekcji 1'!Z98","v":0},{"$f":"'Wyniki z Sekcji 2'!O98","v":0},{"$f":"'Wyniki z Sekcji 2'!U98","v":0},{"$f":"'Wyniki z Sekcji 3'!I98","v":0},0,0]
[{"$f":"IF(ISBLANK('Informacje o klasie'!C103),\"\",('Informacje o klasie'!B103))","v":""},{"$f":"IF(ISBLANK('Informacje o klasie'!C103),\"\",UPPER('Informacje o klasie'!C103)&\", \"&'Informacje o klasie'!D103)","v":""},{"$f":"'Wyniki z Sekcji 1'!O99","v":0},{"$f":"'Wyniki z Sekcji 1'!Z99","v":0},{"$f":"'Wyniki z Sekcji 2'!O99","v":0},{"$f":"'Wyniki z Sekcji 2'!U99","v":0},{"$f":"'Wyniki z Sekcji 3'!I99","v":0},0,0]
[{"$f":"IF(ISBLANK('Informacje o klasie'!C104),\"\",('Informacje o klasie'!B104))","v":""},{"$f":"IF(ISBLANK('Informacje o klasie'!C104),\"\",UPPER('Informacje o klasie'!C104)&\", \"&'Informacje o klasie'!D104)","v":""},{"$f":"'Wyniki z Sekcji 1'!O100","v":0},{"$f":"'Wyniki z Sekcji 1'!Z100","v":0},{"$f":"'Wyniki z Sekcji 2'!O100","v":0},{"$f":"'Wyniki z Sekcji 2'!U100","v":0},{"$f":"'Wyniki z Sekcji 3'!I100","v":0},0,0]
[{"$f":"IF(ISBLANK('Informacje o klasie'!C105),\"\",('Informacje o klasie'!B105))","v":""},{"$f":"IF(ISBLANK('Informacje o klasie'!C105),\"\",UPPER('Informacje o klasie'!C105)&\", \"&'Informacje o klasie'!D105)","v":""},{"$f":"'Wyniki z Sekcji 1'!O101","v":0},{"$f":"'Wyniki z Sekcji 1'!Z101","v":0},{"$f":"'Wyniki z Sekcji 2'!O101","v":0},{"$f":"'Wyniki z Sekcji 2'!U101","v":0},{"$f":"'Wyniki z Sekcji 3'!I101","v":0},0,0]
[{"$f":"IF(ISBLANK('Informacje o klasie'!C106),\"\",('Informacje o klasie'!B106))","v":""},{"$f":"IF(ISBLANK('Informacje o klasie'!C106),\"\",UPPER('Informacje o klasie'!C106)&\", \"&'Informacje o klasie'!D106)","v":""},{"$f":"'Wyniki z Sekcji 1'!O102","v":0},{"$f":"'Wyniki z Sekcji 1'!Z102","v":0},{"$f":"'Wyniki z Sekcji 2'!O102","v":0},{"$f":"'Wyniki z Sekcji 2'!U102","v":0},{"$f":"'Wyniki z Sekcji 3'!I102","v":0},0,0]
[{"$f":"IF(ISBLANK('Informacje o klasie'!C107),\"\",('Informacje o klasie'!B107))","v":""},{"$f":"IF(ISBLANK('Informacje o klasie'!C107),\"\",UPPER('Informacje o klasie'!C107)&\", \"&'Informacje o klasie'!D107)","v":""},{"$f":"'Wyniki z Sekcji 1'!O103","v":0},{"$f":"'Wyniki z Sekcji 1'!Z103","v":0},{"$f":"'Wyniki z Sekcji 2'!O103","v":0},{"$f":"'Wyniki z Sekcji 2'!U103","v":0},{"$f":"'Wyniki z Sekcji 3'!I103","v":0},0,0]
[{"$f":"IF(ISBLANK('Informacje o klasie'!C108),\"\",('Informacje o klasie'!B108))","v":""},{"$f":"IF(ISBLANK('Informacje o klasie'!C108),\"\",UPPER('Informacje o klasie'!C108)&\", \"&'Informacje o klasie'!D108)","v":""},{"$f":"'Wyniki z Sekcji 1'!O104","v":0},{"$f":"'Wyniki z Sekcji 1'!Z104","v":0},{"$f":"'Wyniki z Sekcji 2'!O104","v":0},{"$f":"'Wyniki z Sekcji 2'!U104","v":0},{"$f":"'Wyniki z Sekcji 3'!I104","v":0},0,0]
[{"$f":"IF(ISBLANK('Informacje o klasie'!C109),\"\",('Informacje o klasie'!B109))","v":""},{"$f":"IF(ISBLANK('Informacje o klasie'!C109),\"\",UPPER('Informacje o klasie'!C109)&\", \"&'Informacje o klasie'!D109)","v":""},{"$f":"'Wyniki z Sekcji 1'!O105","v":0},{"$f":"'Wyniki z Sekcji 1'!Z105","v":0},{"$f":"'Wyniki z Sekcji 2'!O105","v":0},{"$f":"'Wyniki z Sekcji 2'!U105","v":0},{"$f":"'Wyniki z Sekcji 3'!I105","v":0},0,0]

{"sheet":"Raport klasy - szczegółowy","index":8,"n_rows":127,"n_cols":6,"rows_kept":127,"cut":false,"hidden":false,"merged":[]}
[]
["Test diagnostyczny 5",null,"Raport klasy - wykresy"]
["Klasa/grupa",null,{"$f":"'Informacje o klasie'!C4","v":0}]
["Data raportu",null,{"$f":"TODAY()","v":"2021-10-04"},"Podręcznik",null,{"$f":"'Informacje o klasie'!C6","v":0}]
["Poziom kursu",null,{"$f":"'Informacje o klasie'!C7","v":"VIII"}]
["Data testu",null,{"$f":"IF(AND(ISBLANK('Informacje o klasie'!$C$10),ISBLANK('Informacje o klasie'!$C$9),ISBLANK('Informacje o klasie'!$C$8)),\"\",\nIF(AND(ISBLANK('Informacje o klasie'!$C$10),ISBLANK('Informacje o klasie'!$C$9)),\"S1: \"&'Informacje o klasie'!$C$8,\nIF(ISBLANK('Informacje o klasie'!$C$10),\"S1: \"&'Informacje o klasie'!$C$8&\"; S2: \"&'Informacje o klasie'!$C$9,\n\"S1: \"&'Informacje o klasie'!$C$8&\"; S2: \"&'Informacje o klasie'!$C$9&\"; S3: \"&'Informacje o klasie'!$C$10)))","v":""}]
[]
[]
[]
[]
[]
[]
[]
[]
[]
[]
[]
[]
[]
[]
[]
[]
[]
[]
[]
[]
[]
[]
[]
[]
[]
[]
[]
[]
[]
[]
[]
[]
[]
[]
[]
[]
[]
[]
[]
[]
[]
[]
[]
[]
[]
[]
[]
[]
[]
[]
[]
[]
[]
[]
[]
[]
[]
[]
[]
[]
[]
[]
[]
[]
[]
[]
[]
[]
[]
[]
[]
[]
[]
[]
[null,"Average","Highest","Lowest"]
[{"$f":"'Raport klasy - ogólny'!A11","v":"ROZUMIENIE ZE SŁUCHU"},{"$f":"'Raport klasy - ogólny'!G11/10","v":{"$error":"#VALUE!"}},{"$f":"'Raport klasy - ogólny'!E11/10","v":0},{"$f":"'Raport klasy - ogólny'!C11/10","v":{"$error":"#VALUE!"}}]
[{"$f":"'Raport klasy - ogólny'!A13","v":"ROZUMIENIE TEKSTÓW PISANYCH"},{"$f":"'Raport klasy - ogólny'!G13/10","v":{"$error":"#VALUE!"}},{"$f":"'Raport klasy - ogólny'!E13/10","v":0},{"$f":"'Raport klasy - ogólny'!C13/10","v":{"$error":"#VALUE!"}}]
[{"$f":"'Raport klasy - ogólny'!A15","v":"ZNAJOMOŚĆ ŚRODKÓW I FUNKCJI JĘZYKOWYCH"},{"$f":"'Raport klasy - ogólny'!G15/10","v":{"$error":"#VALUE!"}},{"$f":"'Raport klasy - ogólny'!E15/10","v":0},{"$f":"'Raport klasy - ogólny'!C15/10","v":{"$error":"#VALUE!"}}]
[{"$f":"'Raport klasy - ogólny'!A17","v":"WYPOWIEDŹ PISEMNA"},{"$f":"'Raport klasy - ogólny'!G17/10","v":{"$error":"#VALUE!"}},{"$f":"'Raport klasy - ogólny'!E17/10","v":0},{"$f":"'Raport klasy - ogólny'!C17/10","v":{"$error":"#VALUE!"}}]
[{"$f":"'Raport klasy - ogólny'!A19","v":"WYPOWIEDŹ USTNA"},{"$f":"'Raport klasy - ogólny'!G19/10","v":{"$error":"#VALUE!"}},{"$f":"'Raport klasy - ogólny'!E19/10","v":0},{"$f":"'Raport klasy - ogólny'!C19/10","v":{"$error":"#VALUE!"}}]
[{"$f":"A82","v":"ROZUMIENIE ZE SŁUCHU"}]
[1,{"$f":"'Wyniki z Sekcji 1'!$E$225","v":{"$error":"#DIV/0!"}}]
[2,{"$f":"'Wyniki z Sekcji 1'!$F$225","v":{"$error":"#DIV/0!"}}]
[3,{"$f":"'Wyniki z Sekcji 1'!$G$225","v":{"$error":"#DIV/0!"}}]
[4,{"$f":"'Wyniki z Sekcji 1'!$H$225","v":{"$error":"#DIV/0!"}}]
[5,{"$f":"'Wyniki z Sekcji 1'!$I$225","v":{"$error":"#DIV/0!"}}]
[6,{"$f":"'Wyniki z Sekcji 1'!$J$225","v":{"$error":"#DIV/0!"}}]
[7,{"$f":"'Wyniki z Sekcji 1'!$K$225","v":{"$error":"#DIV/0!"}}]
[8,{"$f":"'Wyniki z Sekcji 1'!$L$225","v":{"$error":"#DIV/0!"}}]
[9,{"$f":"'Wyniki z Sekcji 1'!$M$225","v":{"$error":"#DIV/0!"}}]
[10,{"$f":"'Wyniki z Sekcji 1'!$N$225","v":{"$error":"#DIV/0!"}}]
[{"$f":"A83","v":"ROZUMIENIE TEKSTÓW PISANYCH"}]
[1,{"$f":"'Wyniki z Sekcji 1'!$P$225","v":{"$error":"#DIV/0!"}}]
[2,{"$f":"'Wyniki z Sekcji 1'!$Q$225","v":{"$error":"#DIV/0!"}}]
[3,{"$f":"'Wyniki z Sekcji 1'!$R$225","v":{"$error":"#DIV/0!"}}]
[4,{"$f":"'Wyniki z Sekcji 1'!$S$225","v":{"$error":"#DIV/0!"}}]
[5,{"$f":"'Wyniki z Sekcji 1'!$T$225","v":{"$error":"#DIV/0!"}}]
[6,{"$f":"'Wyniki z Sekcji 1'!$U$225","v":{"$error":"#DIV/0!"}}]
[7,{"$f":"'Wyniki z Sekcji 1'!$V$225","v":{"$error":"#DIV/0!"}}]
[8,{"$f":"'Wyniki z Sekcji 1'!$W$225","v":{"$error":"#DIV/0!"}}]
[9,{"$f":"'Wyniki z Sekcji 1'!$X$225","v":{"$error":"#DIV/0!"}}]
[10,{"$f":"'Wyniki z Sekcji 1'!$Y$225","v":{"$error":"#DIV/0!"}}]
[{"$f":"A84","v":"ZNAJOMOŚĆ ŚRODKÓW I FUNKCJI JĘZYKOWYCH"}]
[1,{"$f":"'Wyniki z Sekcji 2'!$E$225","v":{"$error":"#DIV/0!"}}]
[2,{"$f":"'Wyniki z Sekcji 2'!$F$225","v":{"$error":"#DIV/0!"}}]
[3,{"$f":"'Wyniki z Sekcji 2'!$G$225","v":{"$error":"#DIV/0!"}}]
[4,{"$f":"'Wyniki z Sekcji 2'!$H$225","v":{"$error":"#DIV/0!"}}]
[5,{"$f":"'Wyniki z Sekcji 2'!$I$225","v":{"$error":"#DIV/0!"}}]
[6,{"$f":"'Wyniki z Sekcji 2'!$J$225","v":{"$error":"#DIV/0!"}}]
[7,{"$f":"'Wyniki z Sekcji 2'!$K$225","v":{"$error":"#DIV/0!"}}]
[8,{"$f":"'Wyniki z Sekcji 2'!$L$225","v":{"$error":"#DIV/0!"}}]
[9,{"$f":"'Wyniki z Sekcji 2'!$M$225","v":{"$error":"#DIV/0!"}}]
[10,{"$f":"'Wyniki z Sekcji 2'!$N$225","v":{"$error":"#DIV/0!"}}]
[{"$f":"A85","v":"WYPOWIEDŹ PISEMNA"}]
[1,{"$f":"'Wyniki z Sekcji 2'!Q225","v":{"$error":"#DIV/0!"}}]
[2,{"$f":"'Wyniki z Sekcji 2'!$S$225","v":{"$error":"#DIV/0!"}}]
[3,{"$f":"'Wyniki z Sekcji 2'!$T$225","v":{"$error":"#DIV/0!"}}]
[{"$f":"A86","v":"WYPOWIEDŹ USTNA"}]
[1,{"$f":"'Wyniki z Sekcji 3'!$F$225","v":{"$error":"#DIV/0!"}}]
[2,{"$f":"'Wyniki z Sekcji 3'!$G$225","v":{"$error":"#DIV/0!"}}]
[3,{"$f":"'Wyniki z Sekcji 3'!$H$225","v":{"$error":"#DIV/0!"}}]

{"sheet":"Hello","index":9,"n_rows":1,"n_cols":1,"rows_kept":1,"cut":false,"hidden":true,"merged":[]}
["Written by Jack Astor for Oxford University Press 2020"]