{"text_format":"1","workbook":"xlsx","n_sheets":10,"sheets":["Instrukcja","Validation","Informacje o klasie","Wyniki z Sekcji 1","Wyniki z Sekcji 2","Wyniki z Sekcji 3","Raport ucznia","Raport klasy - ogólny","Raport klasy - szczegółowy","Hello"],"not_rendered":{"charts":7,"images":9,"macros":1,"external_links":0,"defined_names":11,"comments":0,"pivot_tables":0},"unopened":[],"bounds":{"document_bytes":16777216,"sheet_cells":100000,"rows_first":2000,"rows_last":500,"rows_between":2000,"halvings":0,"cell_chars":16384,"cell_head_chars":4096},"cells_cut":0,"cells_raw":0,"read":"whole","date_system":"1900"}

{"sheet":"Instrukcja","index":0,"n_rows":6,"n_cols":3,"rows_kept":6,"cut":false,"hidden":false,"merged":[]}
[]
[null,1,"Zapisz oddzielną kopię tego pliku dla każdej klasy lub grupy, w której uczysz. "]
[null,2,"W arkuszu „Informacje o klasie” wpisz nazwę klasy lub grupy, np. Klasa IV a, Klasa IV b lub Grupa 1. \nWybierz tytuł podręcznika, z którego będziesz korzystać w danym roku szkolnym.\nWpisz imiona i nazwiska wszystkich uczniów z klasy lub grupy."]
[null,3,"Po ukończeniu testu przez klasę wpisz datę jego przeprowadzenia w arkuszu „Informacje o klasie”, a następnie wpisz wyniki testu w odpowiednich arkuszach: „Wyniki z Sekcji 1” „Wyniki z Sekcji 2” lub „Wyniki z Sekcji 3”."]
[null,4,"Raport podsumowujący wyniki każdego ucznia dostępny jest w arkuszu „Raport ucznia”."]
[null,5,"Raport podsumowujący wyniki każdego ucznia dostępny jest w arkuszu „Raport ucznia”."]

{"sheet":"Validation","index":1,"n_rows":9,"n_cols":13,"rows_kept":9,"cut":false,"hidden":true,"merged":[]}
["Choice list","AC","AD","AE","AH","TF","1-4","1-3","1-2","Test levels","Courebook levels",null,"Course"]
["AC","A","A","A","A","P",0,0,0,"Diagnostic test 2","for the start of grade 5",null,"Link"]
["AD","B","B","B","B","F",1,1,1,null,null,null,"Steps Plus"]
["AE","C","C","C","C",null,2,2,2,null,null,null,"Team Up Plus"]
["AH",null,"D","D","D",null,3,3,null,null,null,null,"Oxford Repetytorium Ósmoklasisty"]
["TF",null,null,"E","E",null,4]
[null,null,null,null,"F"]
[null,null,null,null,"G"]
[null,null,null,null,"H"]

{"sheet":"Informacje o klasie","index":2,"n_rows":112,"n_cols":6,"rows_kept":112,"cut":false,"hidden":false,"merged":[]}
[]
[null,"Informacje o klasie lub grupie"]
[]
[null,"Nazwa klasy lub grupy"]
[null,"Numer testu diagnostycznego","Test diagnostyczny 5"]
[null,"Podręcznik"]
[null,"Test w klasie","VIII"]
[null,"Data testu - Sekcja 1"]
[null,"Data testu - Sekcja 2"]
[null,"Data testu - Sekcja 3"]
[null,"Liczba uczniów (autosuma)",{"$f":"COUNTA(C14:C112)","v":0}]
[]
[null,"Numer","Nazwisko","Imię"]
[null,1,null,null,null,{"$f":"IF(ISBLANK(C14),\"\",UPPER(C14)&\", \"&D14)","v":""}]
[null,2,null,null,null,{"$f":"IF(ISBLANK(C15),\"\",UPPER(C15)&\", \"&D15)","v":""}]
[null,3,null,null,null,{"$f":"IF(ISBLANK(C16),\"\",UPPER(C16)&\", \"&D16)","v":""}]
[null,4,null,null,null,{"$f":"IF(ISBLANK(C17),\"\",UPPER(C17)&\", \"&D17)","v":""}]
[null,5,null,null,null,{"$f":"IF(ISBLANK(C18),\"\",UPPER(C18)&\", \"&D18)","v":""}]
[null,6,null,null,null,{"$f":"IF(ISBLANK(C19),\"\",UPPER(C19)&\", \"&D19)","v":""}]
[null,7,null,null,null,""]
{"$rows_left_out":93}
{"sheet":"Wyniki z Sekcji 1","index":3,"n_rows":226,"n_cols":26,"rows_kept":226,"cut":false,"hidden":false,"merged":[[122,1,122,3],[122,4,122,14],[122,15,122,25],[123,1,123,3],[8,1,8,3],[7,1,7,3],[7,4,7,14],[7,15,7,25],[112,4,112,14],[112,15,112,25]]}
[]
[null,{"$f":"\"Test diagnostyczny 5\"","v":"Test diagnostyczny 5"}]
[null,{"$f":"\"Wyniki z Sekcji 1 (Rozumienie ze słuchu i Rozumienie tekstów pisanych): \"&'Informacje o klasie'!C4","v":"Wyniki z Sekcji 1 (Rozumienie ze słuchu i Rozumienie tekstów pisanych): "}]
[null,{"$f":"\"Data testu - Sekcja 1: \"&'Informacje o klasie'!C8","v":"Data testu - Sekcja 1: "}]
[null,{"$f":"\"Podręcznik: \"&'Informacje o klasie'!C6","v":"Podręcznik: "}]
[null,"Test w klasie VIII"]
[]
[null,null,null,null,"ROZUMIENIE ZE SŁUCHU",null,null,null,null,null,null,null,null,null,null,"ROZUMIENIE TEKSTÓW PISANYCH"]
[null,"Zadanie:",null,null,1,2,3,4,5,6,7,8,9,10,"SUMA",1,2,3,4,5,6,7,8,9,10,"SUMA"]
[{"$f":"C10&\", \"&D10","v":"0, 0"},1,{"$f":"'Informacje o klasie'!C14","v":0},{"$f":"'Informacje o klasie'!D14","v":0},null,null,null,null,null,null,null,null,null,null,{"$f":"O125","v":0},null,null,null,null,null,null,null,null,null,null,{"$f":"Z125","v":0}]
[{"$f":"C11&\", \"&D11","v":"0, 0"},2,{"$f":"'Informacje o klasie'!C15","v":0},{"$f":"'Informacje o klasie'!D15","v":0},null,null,null,null,null,null,null,null,null,null,{"$f":"O126","v":0},null,null,null,null,null,null,null,null,null,null,{"$f":"Z126","v":0}]
["0, 0",3,{"$f":"'Informacje o klasie'!C16","v":0},{"$f":"'Informacje o klasie'!D16","v":0},null,null,null,null,null,null,null,null,null,null,0,null,null,null,null,null,null,null,null,null,null,0]
["0, 0",4,{"$f":"'Informacje o klasie'!C17","v":0},{"$f":"'Informacje o klasie'!D17","v":0},null,null,null,null,null,null,null,null,null,null,0,null,null,null,null,null,null,null,null,null,null,0]
["0, 0",5,{"$f":"'Informacje o klasie'!C18","v":0},{"$f":"'Informacje o klasie'!D18","v":0},null,null,null,null,null,null,null,null,null,null,0,null,null,null,null,null,null,null,null,null,null,0]
["0, 0",6,{"$f":"'Informacje o klasie'!C19","v":0},{"$f":"'Informacje o klasie'!D19","v":0},null,null,null,null,null,null,null,null,null,null,0,null,null,null,null,null,null,null,null,null,null,0]
["0, 0",7,{"$f":"'Informacje o klasie'!C20","v":0},{"$f":"'Informacje o klasie'!D20","v":0},null,null,null,null,null,null,null,null,null,null,0,null,null,null,null,null,null,null,null,null,null,0]
["0, 0",8,{"$f":"'Informacje o klasie'!C21","v":0},{"$f":"'Informacje o klasie'!D21","v":0},null,null,null,null,null,null,null,null,null,null,0,null,null,null,null,null,null,null,null,null,null,0]
["0, 0",9,{"$f":"'Informacje o klasie'!C22","v":0},{"$f":"'Informacje o klasie'!D22","v":0},null,null,null,null,null,null,null,null,null,null,0,null,null,null,null,null,null,null,null,null,null,0]
["0, 0",10,{"$f":"'Informacje o klasie'!C23","v":0},{"$f":"'Informacje o klasie'!D23","v":0},null,null,null,null,null,null,null,null,null,null,0,null,null,null,null,null,null,null,null,null,null,0]
["0, 0",11,{"$f":"'Informacje o klasie'!C24","v":0},{"$f":"'Informacje o klasie'!D24","v":0},null,null,null,null,null,null,null,null,null,null,0,null,null,null,null,null,null,null,null,null,null,0]
{"$rows_left_out":207}
{"sheet":"Wyniki z Sekcji 2","index":4,"n_rows":226,"n_cols":21,"rows_kept":226,"cut":false,"hidden":false,"merged":[[122,1,122,3],[122,4,122,14],[122,18,122,20],[123,1,123,3],[7,1,7,3],[7,4,7,14],[8,1,8,3],[112,4,112,14],[112,18,112,20],[7,15,7,20]]}
[]
[null,"Test diagnostyczny 5"]
[null,{"$f":"\"Wyniki z Sekcji 2 (Środki i funkcje językowe i Wypowiedź pisemna): \"&'Informacje o klasie'!C4","v":"Wyniki z Sekcji 2 (Środki i funkcje językowe i Wypowiedź pisemna): "}]
[null,{"$f":"\"Data testu - Sekcja 2: \"&'Informacje o klasie'!C9","v":"Data testu - Sekcja 2: "}]
[null,{"$f":"\"Podręcznik: \"&'Informacje o klasie'!C6","v":"Podręcznik: "}]
[null,"Test w klasie VIII"]
[]
[null,null,null,null,"ZNAJOMOŚĆ ŚRODKÓW I FUNKCJI JĘZYKOWYCH",null,null,null,null,null,null,null,null,null,null,"WYPOWIEDŹ PISEMNA"]
[null,"Zadanie:",null,null,1,2,3,4,5,6,7,8,9,10,"SUMA","Temat","Treść ","Spójność \ni logika wypowiedzi ","Zakres środków językowych ","Poprawność środków językowych ","SUMA"]
[{"$f":"C10&\", \"&D10","v":"0, 0"},1,{"$f":"'Informacje o klasie'!C14","v":0},{"$f":"'Informacje o klasie'!D14","v":0},null,null,null,null,null,null,null,null,null,null,{"$f":"O125","v":0},null,null,null,null,null,{"$f":"SUM(P10:T10)","v":0}]
[{"$f":"C11&\", \"&D11","v":"0, 0"},2,{"$f":"'Informacje o klasie'!C15","v":0},{"$f":"'Informacje o klasie'!D15","v":0},null,null,null,null,null,null,null,null,null,null,{"$f":"O126","v":0},null,null,null,null,null,0]
["0, 0",3,{"$f":"'Informacje o klasie'!C16","v":0},{"$f":"'Informacje o klasie'!D16","v":0},null,null,null,null,null,null,null,null,null,null,0,null,null,null,null,null,0]
["0, 0",4,{"$f":"'Informacje o klasie'!C17","v":0},{"$f":"'Informacje o klasie'!D17","v":0},null,null,null,null,null,null,null,null,null,null,0,null,null,null,null,null,0]
["0, 0",5,{"$f":"'Informacje o klasie'!C18","v":0},{"$f":"'Informacje o klasie'!D18","v":0},null,null,null,null,null,null,null,null,null,null,0,null,null,null,null,null,0]
["0, 0",6,{"$f":"'Informacje o klasie'!C19","v":0},{"$f":"'Informacje o klasie'!D19","v":0},null,null,null,null,null,null,null,null,null,null,0,null,null,null,null,null,0]
["0, 0",7,{"$f":"'Informacje o klasie'!C20","v":0},{"$f":"'Informacje o klasie'!D20","v":0},null,null,null,null,null,null,null,null,null,null,0,null,null,null,null,null,0]
["0, 0",8,{"$f":"'Informacje o klasie'!C21","v":0},{"$f":"'Informacje o klasie'!D21","v":0},null,null,null,null,null,null,null,null,null,null,0,null,null,null,null,null,0]
["0, 0",9,{"$f":"'Informacje o klasie'!C22","v":0},{"$f":"'Informacje o klasie'!D22","v":0},null,null,null,null,null,null,null,null,null,null,0,null,null,null,null,null,0]
["0, 0",10,{"$f":"'Informacje o klasie'!C23","v":0},{"$f":"'Informacje o klasie'!D23","v":0},null,null,null,null,null,null,null,null,null,null,0,null,null,null,null,null,0]
["0, 0",11,{"$f":"'Informacje o klasie'!C24","v":0},{"$f":"'Informacje o klasie'!D24","v":0},null,null,null,null,null,null,null,null,null,null,0,null,null,null,null,null,0]
{"$rows_left_out":207}
{"sheet":"Wyniki z Sekcji 3","index":5,"n_rows":226,"n_cols":9,"rows_kept":226,"cut":false,"hidden":false,"merged":[[7,4,7,8],[112,6,112,8],[122,6,122,8],[122,1,122,3],[123,1,123,3],[7,1,7,3],[8,1,8,3]]}
[]
[null,"Test diagnostyczny 5"]
[null,{"$f":"\"Wynki z Sekcji 3 (Wypowiedź ustna): \"&'Informacje o klasie'!C4","v":"Wynki z Sekcji 3 (Wypowiedź ustna): "}]
[null,{"$f":"\"Data testu - Sekcja 3: \"&'Informacje o klasie'!C10","v":"Data testu - Sekcja 3: "}]
[null,{"$f":"\"Podręcznik: \"&'Informacje o klasie'!C6","v":"Podręcznik: "}]
[null,"Test w klasie VIII"]
[]
[null,null,null,null,"WYPOWIEDŹ USTNA"]
[null,null,null,null,"Temat","Gramatyka","Słownictwo","Komunikatywność","SUMA"]
[{"$f":"C10&\", \"&D10","v":"0, 0"},1,{"$f":"'Informacje o klasie'!C14","v":0},{"$f":"'Informacje o klasie'!D14","v":0},null,null,null,null,{"$f":"SUM(E10:H10)","v":0}]
[{"$f":"C11&\", \"&D11","v":"0, 0"},2,{"$f":"'Informacje o klasie'!C15","v":0},{"$f":"'Informacje o klasie'!D15","v":0},null,null,null,null,{"$f":"SUM(E11:H11)","v":0}]
["0, 0",3,{"$f":"'Informacje o klasie'!C16","v":0},{"$f":"'Informacje o klasie'!D16","v":0},null,null,null,null,0]
["0, 0",4,{"$f":"'Informacje o klasie'!C17","v":0},{"$f":"'Informacje o klasie'!D17","v":0},null,null,null,null,0]
["0, 0",5,{"$f":"'Informacje o klasie'!C18","v":0},{"$f":"'Informacje o klasie'!D18","v":0},null,null,null,null,0]
["0, 0",6,{"$f":"'Informacje o klasie'!C19","v":0},{"$f":"'Informacje o klasie'!D19","v":0},null,null,null,null,0]
["0, 0",7,{"$f":"'Informacje o klasie'!C20","v":0},{"$f":"'Informacje o klasie'!D20","v":0},null,null,null,null,0]
["0, 0",8,{"$f":"'Informacje o klasie'!C21","v":0},{"$f":"'Informacje o klasie'!D21","v":0},null,null,null,null,0]
["0, 0",9,{"$f":"'Informacje o klasie'!C22","v":0},{"$f":"'Informacje o klasie'!D22","v":0},null,null,null,null,0]
["0, 0",10,{"$f":"'Informacje o klasie'!C23","v":0},{"$f":"'Informacje o klasie'!D23","v":0},null,null,null,null,0]
["0, 0",11,{"$f":"'Informacje o klasie'!C24","v":0},{"$f":"'Informacje o klasie'!D24","v":0},null,null,null,null,0]
{"$rows_left_out":207}
{"sheet":"Raport ucznia","index":6,"n_rows":36,"n_cols":10,"rows_kept":36,"cut":false,"hidden":false,"merged":[[14,0,14,6],[16,0,16,6],[12,0,12,6],[2,2,2,5],[3,2,3,5],[8,0,8,6],[10,0,10,6]]}
[]
["Test diagnostyczny 5",null,null,null,"Raport ucznia"]
["Nazwisko ucznia",null,null,null,null,null,"Klasa/Grupa",null,{"$f":"'Informacje o klasie'!C4","v":0}]
["Data raportu",null,{"$f":"TODAY()","v":"2021-10-04"},null,null,null,"Podręcznik",null,{"$f":"'Informacje o klasie'!C6","v":0}]
["Test w klasie ",null,"VIII"]
["Data testu  ",null,{"$f":"IF(AND(ISBLANK('Informacje o klasie'!$C$10),ISBLANK('Informacje o klasie'!$C$9),ISBLANK('Informacje o klasie'!$C$8)),\"\",\nIF(AND(ISBLANK('Informacje o klasie'!$C$10),ISBLANK('Informacje o klasie'!$C$9)),\"S1: \"&'Informacje o klasie'!$C$8,\nIF(ISBLANK('Informacje o klasie'!$C$10),\"S1: \"&'Informacje o klasie'!$C$8&\"; S2: \"&'Informacje o klasie'!$C$9,\n\"S1: \"&'Informacje o klasie'!$C$8&\"; S2: \"&'Informacje o klasie'!$C$9&\"; S3: \"&'Informacje o klasie'!$C$10)))","v":""}]
[]
[{"$f":"'Wyniki z Sekcji 1'!E8","v":"ROZUMIENIE ZE SŁUCHU"},"Punkty ucznia",{"$f":"IFERROR(INDEX('Wyniki z Sekcji 1'!$O:$O,MATCH('Raport ucznia'!$C$3,'Wyniki z Sekcji 1'!$A:$A,0)),0)","v":0},"Średnia klasy/grupy",{"$f":"IFERROR('Wyniki z Sekcji 1'!$O$226,\"\")","v":""},"Maks. liczba punktów",10]
["Rozumienie prostych wypowiedzi ustnych \nZnajdowanie określonych informacji w wypowiedzi"]
[{"$f":"'Wyniki z Sekcji 1'!P8","v":"ROZUMIENIE TEKSTÓW PISANYCH"},"Punkty ucznia",{"$f":"IFERROR(INDEX('Wyniki z Sekcji 1'!$Z:$Z,MATCH('Raport ucznia'!$C$3,'Wyniki z Sekcji 1'!$A:$A,0)),0)","v":0},"Średnia klasy/grupy",{"$f":"IFERROR('Wyniki z Sekcji 1'!$Z$226,\"\")","v":""},"Maks. liczba punktów",10]
["Rozumienie prostych wypowiedzi pisemnych\nZnajdowanie określonych informacji w tekście"]
[{"$f":"'Wyniki z Sekcji 2'!E8","v":"ZNAJOMOŚĆ ŚRODKÓW I FUNKCJI JĘZYKOWYCH"},"Punkty ucznia",{"$f":"IFERROR(INDEX('Wyniki z Sekcji 2'!$O:$O,MATCH('Raport ucznia'!$C$3,'Wyniki z Sekcji 2'!$A:$A,0)),0)","v":0},"Średnia klasy/grupy",{"$f":"IFERROR('Wyniki z Sekcji 2'!$O$226,\"\")","v":""},"Maks. liczba punktów",10]
["Posługiwanie się podstawowym zasobem środków językowych w zakresie następujących tematów: człowiek, życie prywatne, sport, świat przyrody"]
[{"$f":"'Wyniki z Sekcji 2'!P8","v":"WYPOWIEDŹ PISEMNA"},"Punkty ucznia",{"$f":"IFERROR(INDEX('Wyniki z Sekcji 2'!$U:$U,MATCH('Raport ucznia'!$C$3,'Wyniki z Sekcji 2'!$A:$A,0)),0)","v":0},"Średnia klasy/grupy",{"$f":"IFERROR('Wyniki z Sekcji 2'!$U$226,\"\")","v":""},"Maks. liczba punktów",10]
["Tworzenie krótkiej, prostej spójnej i logicznej wypowiedzi pisemnej"]
[{"$f":"'Wyniki z Sekcji 3'!E8","v":"WYPOWIEDŹ USTNA"},"Punkty ucznia",{"$f":"IFERROR(INDEX('Wyniki z Sekcji 3'!I:I,MATCH('Raport ucznia'!$C$3,'Wyniki z Sekcji 3'!A:A,0)),0)","v":0},"Średnia klasy/grupy",{"$f":"IFERROR('Wyniki z Sekcji 3'!$I$226,\"\")","v":""},"Maks. liczba punktów",10]
["Tworzenie krótkiej, prostej, spójnej i logicznej wypowiedzi ustnej"]
["SUMA ","Punkty ucznia ",{"$f":"C8+C10+C12+C14+C16","v":0},"Średnia klasy/grupy",{"$f":"IFERROR(E8+E10+E12+E14+E16,\"\")","v":""},"Maks. liczba punktów",50]
[]
[]
{"$rows_left_out":17}
{"sheet":"Raport klasy - ogólny","index":7,"n_rows":118,"n_cols":9,"rows_kept":118,"cut":false,"hidden":false,"merged":[[11,0,11,8],[13,0,13,8],[15,0,15,8],[17,0,17,8],[19,0,19,8]]}
[]
[{"$f":"\"Test diagnostyczny 5\"","v":"Test diagnostyczny 5"},null,"Raport klasy - tabele"]
["Klasa/Grupa",null,{"$f":"'Informacje o klasie'!C4","v":0}]
["Data raportu",null,{"$f":"TODAY()","v":"2021-10-04"},null,"Podręcznik",null,{"$f":"'Informacje o klasie'!C6","v":0}]
["Test w klasie ",null,"VIII"]
["Data testu",null,{"$f":"IF(AND(ISBLANK('Informacje o klasie'!$C$10),ISBLANK('Informacje o klasie'!$C$9),ISBLANK('Informacje o klasie'!$C$8)),\"\",\nIF(AND(ISBLANK('Informacje o klasie'!$C$10),ISBLANK('Informacje o klasie'!$C$9)),\"S1: \"&'Informacje o klasie'!$C$8,\nIF(ISBLANK('Informacje o klasie'!$C$10),\"S1: \"&'Informacje o klasie'!$C$8&\"; S2: \"&'Informacje o klasie'!$C$9,\n\"S1: \"&'Informacje o klasie'!$C$8&\"; S2: \"&'Informacje o klasie'!$C$9&\"; S3: \"&'Informacje o klasie'!$C$10)))","v":""}]
["Najniższa liczba punktów w klasie/grupie",null,{"$f":"IFERROR(SMALL(H22:H118,COUNTIF(H22:H118,0)+1),\"\")","v":""}]
["Najwyższa liczba punktów w klasie/grupie",null,{"$f":"MAX(H22:H118)","v":0}]
["Średnia liczba punktów w klasie/grupie",null,{"$f":"IFERROR(ROUND(SUM(H22:H118)/'Informacje o klasie'!C11,0),\"\")","v":""}]
[]
[{"$f":"'Raport ucznia'!A8","v":"ROZUMIENIE ZE SŁUCHU"},"Najniższa liczba punktów",{"$f":"IFERROR(SMALL(C$22:C$118,COUNTIF(C$22:C$118,0)+1),\"\")","v":""},"Najwyższa liczba punktów",{"$f":"MAX(C$22:C$118)","v":0},"Średnia klasy/grupy",{"$f":"IFERROR(ROUND(SUM(C$22:C$118)/'Informacje o klasie'!$C$11,0),\"\")","v":""},"Maks. liczba punktów",10]
[{"$f":"'Raport ucznia'!A9:G9","v":"Rozumienie prostych wypowiedzi ustnych \nZnajdowanie określonych informacji w wypowiedzi"}]
[{"$f":"'Raport ucznia'!A10","v":"ROZUMIENIE TEKSTÓW PISANYCH"},"Najniższa liczba punktów",{"$f":"IFERROR(SMALL(D$22:D$118,COUNTIF(D$22:D$118,0)+1),\"\")","v":""},"Najwyższa liczba punktów",{"$f":"MAX(D$22:D$118)","v":0},"Średnia klasy/grupy",{"$f":"IFERROR(ROUND(SUM(D$22:D$118)/'Informacje o klasie'!$C$11,0),\"\")","v":""},"Maks. liczba punktów",10]
[{"$f":"'Raport ucznia'!A11:G11","v":"Rozumienie prostych wypowiedzi pisemnych\nZnajdowanie określonych informacji w tekście"}]
[{"$f":"'Raport ucznia'!A12","v":"ZNAJOMOŚĆ ŚRODKÓW I FUNKCJI JĘZYKOWYCH"},"Najniższa liczba punktów",{"$f":"IFERROR(SMALL(E$22:E$118,COUNTIF(E$22:E$118,0)+1),\"\")","v":""},"Najwyższa liczba punktów",{"$f":"MAX(E$22:E$118)","v":0},"Średnia klasy/grupy",{"$f":"IFERROR(ROUND(SUM(E$22:E$118)/'Informacje o klasie'!$C$11,0),\"\")","v":""},"Maks. liczba punktów",10]
[{"$f":"'Raport ucznia'!A13:G13","v":"Posługiwanie się podstawowym zasobem środków językowych w zakresie następujących tematów: człowiek, życie prywatne, sport, świat przyrody"}]
[{"$f":"'Raport ucznia'!A14","v":"WYPOWIEDŹ PISEMNA"},"Najniższa liczba punktów",{"$f":"IFERROR(SMALL(F$22:F$118,COUNTIF(F$22:F$118,0)+1),\"\")","v":""},"Najwyższa liczba punktów",{"$f":"MAX(F$22:F$118)","v":0},"Średnia klasy/grupy",{"$f":"IFERROR(ROUND(SUM(F$22:F$118)/'Informacje o klasie'!$C$11,0),\"\")","v":""},"Maks. liczba punktów",10]
[{"$f":"'Raport ucznia'!A15:G15","v":"Tworzenie krótkiej, prostej spójnej i logicznej wypowiedzi pisemnej"}]
[{"$f":"'Raport ucznia'!A16","v":"WYPOWIEDŹ USTNA"},"Najniższa liczba punktów",{"$f":"IFERROR(SMALL(G$22:G$118,COUNTIF(G$22:G$118,0)+1),\"\")","v":""},"Najwyższa liczba punktów",{"$f":"MAX(G$22:G$118)","v":0},"Średnia klasy/grupy",{"$f":"IFERROR(ROUND(SUM(G$22:G$118)/'Informacje o klasie'!$C$11,0),\"\")","v":""},"Maks. liczba punktów",10]
[{"$f":"'Raport ucznia'!A17:G17","v":"Tworzenie krótkiej, prostej, spójnej i logicznej wypowiedzi ustnej"}]
{"$rows_left_out":99}
{"sheet":"Raport klasy - szczegółowy","index":8,"n_rows":127,"n_cols":6,"rows_kept":127,"cut":false,"hidden":false,"merged":[]}
[]
["Test diagnostyczny 5",null,"Raport klasy - wykresy"]
["Klasa/grupa",null,{"$f":"'Informacje o klasie'!C4","v":0}]
["Data raportu",null,{"$f":"TODAY()","v":"2021-10-04"},"Podręcznik",null,{"$f":"'Informacje o klasie'!C6","v":0}]
["Poziom kursu",null,{"$f":"'Informacje o klasie'!C7","v":"VIII"}]
["Data testu",null,{"$f":"IF(AND(ISBLANK('Informacje o klasie'!$C$10),ISBLANK('Informacje o klasie'!$C$9),ISBLANK('Informacje o klasie'!$C$8)),\"\",\nIF(AND(ISBLANK('Informacje o klasie'!$C$10),ISBLANK('Informacje o klasie'!$C$9)),\"S1: \"&'Informacje o klasie'!$C$8,\nIF(ISBLANK('Informacje o klasie'!$C$10),\"S1: \"&'Informacje o klasie'!$C$8&\"; S2: \"&'Informacje o klasie'!$C$9,\n\"S1: \"&'Informacje o klasie'!$C$8&\"; S2: \"&'Informacje o klasie'!$C$9&\"; S3: \"&'Informacje o klasie'!$C$10)))","v":""}]
[]
[]
[]
[]
[]
[]
[]
[]
[]
[]
[]
[]
[]
[]
{"$rows_left_out":108}
{"sheet":"Hello","index":9,"n_rows":1,"n_cols":1,"rows_kept":1,"cut":false,"hidden":true,"merged":[]}
["Written by Jack Astor for Oxford University Press 2020"]